Assault (Custodian)
type: Concept
issued: 2019-07-18T10:37:37
attribution URL: http://www.historicengland.org.uk
publisher: www.historicengland.org.uk
attribution name: Historic England
in scheme: Heritage Crime Thesaurus
license: http://creativecommons.org/licenses/by/3.0
scope note: A crime of violence against the custodian of a heritage site. Double index with the type and severity of the assault if known).

Heritage Crime Thesaurus
type: ConceptScheme
attribution name: Historic England
has top concept: Crime
publisher: www.historicengland.org.uk
attribution URL: http://www.historicengland.org.uk
license: http://creativecommons.org/licenses/by/3.0
description: Thesaurus for indexing types of crime and incidents against heritage assets (e.g. graffiti, theft, unauthorized diving).
issued: 2019-07-18

Fly Tipping
type: Concept
issued: 2019-07-18T10:37:37
broader: Environmental Crime
attribution URL: http://www.historicengland.org.uk
license: http://creativecommons.org/licenses/by/3.0
broader: Anti Social Behavior (Environmental)
attribution name: Historic England
in scheme: Heritage Crime Thesaurus
publisher: www.historicengland.org.uk
scope note: The illegal deposit of any waste onto land that is not licensed to accept waste.

Environmental Crime
type: Concept
narrower: Fly Posting
publisher: www.historicengland.org.uk
issued: 2019-07-18T10:37:37
scope note: Illegal acts which directly harm the environment.
narrower: Fly Tipping
license: http://creativecommons.org/licenses/by/3.0
in scheme: Heritage Crime Thesaurus
attribution name: Historic England
attribution URL: http://www.historicengland.org.uk
narrower: Littering
broader: Crime

Anti Social Behavior (Environmental)
type: Concept
narrower: Public Defecation
narrower: Fly Tipping
narrower: Off Roading
license: http://creativecommons.org/licenses/by/3.0
narrower: Wildlife Trapping
narrower: Noise
narrower: Littering
narrower: Wildlife Disturbance
narrower: Wildlife Shooting
narrower: Fly Posting
narrower: Flora Removal
attribution URL: http://www.historicengland.org.uk
publisher: www.historicengland.org.uk
narrower: Bird Egg Removal
narrower: Public Urination
narrower: Unlicensed Rave
narrower: Wildlife Poisoning
issued: 2019-07-18T10:37:37
narrower: Abandoned Vehicle
in scheme: Heritage Crime Thesaurus
attribution name: Historic England
narrower: Illegal Parking
broader: Anti Social Behavior
narrower: Uncontrolled Animals

Bronze Theft
type: Concept
license: http://creativecommons.org/licenses/by/3.0
in scheme: Heritage Crime Thesaurus
attribution name: Historic England
attribution URL: http://www.historicengland.org.uk
scope note: The illegal removal of bronze external fittings or artefacts from heritage assets.
broader: Metal Theft
publisher: www.historicengland.org.uk
issued: 2019-07-18T10:37:37

Metal Theft
type: Concept
issued: 2019-07-18T10:37:37
narrower: Bronze Theft
broader: Theft
publisher: www.historicengland.org.uk
attribution name: Historic England
attribution URL: http://www.historicengland.org.uk
scope note: The illegal removal of structural metal fittings, such as a lead roof or cast iron drainpipes, from heritage assets.
in scheme: Heritage Crime Thesaurus
narrower: Copper Theft
narrower: Iron Theft
narrower: Brass Theft
license: http://creativecommons.org/licenses/by/3.0
narrower: Lead Theft

Airgun Misuse
type: Concept
attribution URL: http://www.historicengland.org.uk
license: http://creativecommons.org/licenses/by/3.0
attribution name: Historic England
in scheme: Heritage Crime Thesaurus
broader: Firearm Misuse
issued: 2019-07-18T10:37:37
scope note: The improper use of a airgun in a public place and/or the use of a firearm to threaten or inflict violence or harm.
publisher: www.historicengland.org.uk

Firearm Misuse
type: Concept
narrower: Rifle Misuse
attribution name: Historic England
narrower: Airgun Misuse
in scheme: Heritage Crime Thesaurus
broader: Nuisance Behaviour
license: http://creativecommons.org/licenses/by/3.0
issued: 2019-07-18T10:37:37
narrower: Shotgun Misuse
publisher: www.historicengland.org.uk
scope note: The improper use of a firearm in a public place and/or the use of a firearm to threaten or inflict violence or harm.
attribution URL: http://www.historicengland.org.uk
broader: Anti Social Behavior (Nuisance)

Begging
type: Concept
in scheme: Heritage Crime Thesaurus
attribution name: Historic England
attribution URL: http://www.historicengland.org.uk
alternative label: Panhandling
license: http://creativecommons.org/licenses/by/3.0
publisher: www.historicengland.org.uk
issued: 2019-07-18T10:37:37
broader: Nuisance Behaviour
scope note: The act of attempting to secure material benefits from others in a public place.
broader: Anti Social Behavior (Nuisance)

Nuisance Behaviour
type: Concept
narrower: Ritual Activity
narrower: Unauthorized Game Playing
narrower: Firearm Misuse
narrower: Public Urination
narrower: Drug Dealing
attribution URL: http://www.historicengland.org.uk
license: http://creativecommons.org/licenses/by/3.0
publisher: www.historicengland.org.uk
attribution name: Historic England
in scheme: Heritage Crime Thesaurus
narrower: Illegal Sports
narrower: Unlicensed Rave
issued: 2019-07-18T10:37:37
narrower: Begging
narrower: Public Defecation
broader: Crime
narrower: Uncontrolled Animals
narrower: Firework Misuse
narrower: Alcohol Misuse
scope note: Behaviour that is either irritating, irksome and/or harmful or offensive to the public for which there is a legal remedy.
narrower: Rowdiness
narrower: Drug Misuse
narrower: Noise

Anti Social Behavior (Nuisance)
type: Concept
in scheme: Heritage Crime Thesaurus
attribution URL: http://www.historicengland.org.uk
narrower: Firearm Misuse
issued: 2019-07-18T10:37:37
narrower: Rowdiness
narrower: Drug Dealing
narrower: Alcohol Misuse
narrower: Firework Misuse
narrower: Ritual Activity
publisher: www.historicengland.org.uk
narrower: Unauthorized Game Playing
broader: Anti Social Behavior
narrower: Drug Misuse
license: http://creativecommons.org/licenses/by/3.0
attribution name: Historic England
narrower: Begging

Urban Exploration
type: Concept
in scheme: Heritage Crime Thesaurus
license: http://creativecommons.org/licenses/by/3.0
broader: Unauthorized Access
attribution URL: http://www.historicengland.org.uk
issued: 2019-07-18T10:37:37
publisher: www.historicengland.org.uk
attribution name: Historic England
scope note: The exploration of the normally unseen or off-limits parts of heritage sites without the permission of the owner.

Unauthorized Access
type: Concept
issued: 2019-07-18T10:37:37
publisher: www.historicengland.org.uk
attribution URL: http://www.historicengland.org.uk
narrower: Urban Exploration
attribution name: Historic England
in scheme: Heritage Crime Thesaurus
narrower: Unauthorized Diving
license: http://creativecommons.org/licenses/by/3.0
broader: Crime
scope note: The act of causing damage to a standing heritage asset by climbing upon its structure.

Theft
type: Concept
narrower: Metal Theft
publisher: www.historicengland.org.uk
in scheme: Heritage Crime Thesaurus
issued: 2019-07-18T10:37:37
broader: Removal Of Objects
attribution name: Historic England
scope note: The illegal taking of another person's property without that person's freely-given consent. Theft covers the illegal removal of artefacts from archaeological sites and the removal of lead and other architectural fittings from standing heritage assets.
related: Equipped To Commit Crime
narrower: Architectural Theft
attribution URL: http://www.historicengland.org.uk
license: http://creativecommons.org/licenses/by/3.0
narrower: Cultural Theft

Removal Of Objects
type: Concept
attribution URL: http://www.historicengland.org.uk
issued: 2019-07-18T10:37:37
publisher: www.historicengland.org.uk
narrower: Unauthorized Salvaging
attribution name: Historic England
narrower: Theft
scope note: The illegal removal of cultural objects from a heritage asset.
in scheme: Heritage Crime Thesaurus
license: http://creativecommons.org/licenses/by/3.0
narrower: Nighthawking
broader: Damage
narrower: Flora Removal

Equipped To Commit Crime
type: Concept
issued: 2019-07-18T10:37:37
broader: Crime
in scheme: Heritage Crime Thesaurus
license: http://creativecommons.org/licenses/by/3.0
attribution name: Historic England
related: Criminal Damage
attribution URL: http://www.historicengland.org.uk
publisher: www.historicengland.org.uk
related: Graffiti
scope note: Being apprehended in a public place whilst in possession of the equipment required to commit a particular type of crime.
related: Theft

Architectural Theft
type: Concept
attribution URL: http://www.historicengland.org.uk
issued: 2019-07-18T10:37:37
in scheme: Heritage Crime Thesaurus
publisher: www.historicengland.org.uk
license: http://creativecommons.org/licenses/by/3.0
attribution name: Historic England
scope note: The illegal removal of architectural features from heritage assets.
broader: Theft

Cultural Theft
type: Concept
issued: 2019-07-18T10:37:37
publisher: www.historicengland.org.uk
attribution URL: http://www.historicengland.org.uk
attribution name: Historic England
in scheme: Heritage Crime Thesaurus
broader: Theft
scope note: The illegal removal of fittings and internal furnishings from heritage assets.
license: http://creativecommons.org/licenses/by/3.0

Assault (Volunteer)
type: Concept
publisher: www.historicengland.org.uk
license: http://creativecommons.org/licenses/by/3.0
scope note: A crime of violence against a volunteer at a heritage site. Double index with the type and severity of the assault if known).
issued: 2019-07-18T10:37:37
in scheme: Heritage Crime Thesaurus
attribution name: Historic England
broader: Assault
attribution URL: http://www.historicengland.org.uk

Assault
type: Concept
narrower: Sexual Assault
license: http://creativecommons.org/licenses/by/3.0
narrower: Assault (Visitor)
in scheme: Heritage Crime Thesaurus
narrower: Minor Assault
attribution name: Historic England
scope note: A crime of violence against another person. Use more specific type where known.
publisher: www.historicengland.org.uk
attribution URL: http://www.historicengland.org.uk
narrower: Assault (Volunteer)
issued: 2019-07-18T10:37:37
narrower: Serious Assault
narrower: Fatal Assault
broader: Crime

Unauthorized Diving
type: Concept
scope note: The act of diving a wreck site that has been designated, under either the Protection of Wrecks Act 1973 or the Protection of Military Remains Act 1986, without a license.
attribution URL: http://www.historicengland.org.uk
issued: 2019-07-18T10:37:37
related: Unauthorized Salvaging
in scheme: Heritage Crime Thesaurus
publisher: www.historicengland.org.uk
license: http://creativecommons.org/licenses/by/3.0
broader: Unauthorized Access
attribution name: Historic England

Unauthorized Salvaging
type: Concept
license: http://creativecommons.org/licenses/by/3.0
publisher: www.historicengland.org.uk
attribution name: Historic England
alternative label: Wrecking
in scheme: Heritage Crime Thesaurus
issued: 2019-07-18T10:37:37
broader: Removal Of Objects
related: Unauthorized Diving
scope note: The act of removing cultural artefacts from a wreck site that has been designated, under either the Protection of Wrecks Act 1973 or the Protection of Military Remains Act 1986, without a license.
attribution URL: http://www.historicengland.org.uk

Badger Baiting
type: Concept
broader: Badger Disturbance
in scheme: Heritage Crime Thesaurus
publisher: www.historicengland.org.uk
license: http://creativecommons.org/licenses/by/3.0
broader: Natural Environment
attribution name: Historic England
broader: Illegal Sports
scope note: An illegal blood sport in which badgers are forced to fight a sucession of dogs.
attribution URL: http://www.historicengland.org.uk
issued: 2019-07-18T10:37:37

Badger Disturbance
type: Concept
broader: Wildlife Disturbance
attribution URL: http://www.historicengland.org.uk
publisher: www.historicengland.org.uk
issued: 2019-07-18T10:37:37
narrower: Badger Baiting
in scheme: Heritage Crime Thesaurus
license: http://creativecommons.org/licenses/by/3.0
scope note: The act disturbing a Badger sett without a licence.
attribution name: Historic England

Natural Environment
type: Concept
in scheme: Heritage Crime Thesaurus
narrower: Badger Baiting
narrower: Bird Egg Removal
narrower: Flora Removal
issued: 2019-07-18T10:37:37
scope note: Illegal actions that impact directly upon the natural environment.
narrower: Wildlife Disturbance
narrower: Wildlife Poisoning
license: http://creativecommons.org/licenses/by/3.0
broader: Crime
narrower: Wildlife Shooting
attribution URL: http://www.historicengland.org.uk
publisher: www.historicengland.org.uk
narrower: Wildlife Trapping
attribution name: Historic England

Illegal Sports
type: Concept
attribution name: Historic England
in scheme: Heritage Crime Thesaurus
narrower: Badger Baiting
license: http://creativecommons.org/licenses/by/3.0
broader: Nuisance Behaviour
attribution URL: http://www.historicengland.org.uk
issued: 2019-07-18T10:37:37
narrower: Wildlife Shooting
scope note: Any sport that has been deemed illegal due to it either involving abuse against people or animals or becuase the sport is violent and/or dangerous in nature.
publisher: www.historicengland.org.uk

Rowdiness
type: Concept
broader: Anti Social Behavior (Nuisance)
issued: 2019-07-18T10:37:37
publisher: www.historicengland.org.uk
attribution URL: http://www.historicengland.org.uk
license: http://creativecommons.org/licenses/by/3.0
scope note: Disorderly and noisy behaviour.
broader: Nuisance Behaviour
attribution name: Historic England
in scheme: Heritage Crime Thesaurus

Wildlife Shooting
type: Concept
publisher: www.historicengland.org.uk
issued: 2019-07-18T10:37:37
broader: Anti Social Behavior (Environmental)
scope note: The illegal or unlicensed shooting of animals with firearms or bow weapons.
in scheme: Heritage Crime Thesaurus
attribution name: Historic England
attribution URL: http://www.historicengland.org.uk
broader: Illegal Sports
broader: Natural Environment
license: http://creativecommons.org/licenses/by/3.0

Abandoned Vehicle
type: Concept
broader: Inappropriate Use Of Vehicles
in scheme: Heritage Crime Thesaurus
publisher: www.historicengland.org.uk
license: http://creativecommons.org/licenses/by/3.0
scope note: The act of disposing of a vehicle in a place where it is illegal to leave it.
attribution name: Historic England
attribution URL: http://www.historicengland.org.uk
issued: 2019-07-18T10:37:37
broader: Anti Social Behavior (Environmental)

Inappropriate Use Of Vehicles
type: Concept
attribution URL: http://www.historicengland.org.uk
issued: 2019-07-18T10:37:37
broader: Crime
narrower: Abandoned Vehicle
narrower: Illegal Parking
narrower: Off Roading
scope note: The anti-social use of a vehicle and nuisance caused by behaviour associated with vehicle usage.
publisher: www.historicengland.org.uk
broader: Damage
in scheme: Heritage Crime Thesaurus
license: http://creativecommons.org/licenses/by/3.0
narrower: Vehicle Noise
attribution name: Historic England

Voyeurism
type: Concept
publisher: www.historicengland.org.uk
attribution URL: http://www.historicengland.org.uk
scope note: The act of obtaining sexual stimulation from the covert observation of the sexual organs or actions of others.
attribution name: Historic England
in scheme: Heritage Crime Thesaurus
license: http://creativecommons.org/licenses/by/3.0
broader: Public Sex Environment
issued: 2019-07-18T10:37:37
alternative label: Peeping Tom

Public Sex Environment
type: Concept
narrower: Sex Working
narrower: Sexual Assault
narrower: Sexual Paraphanalia
issued: 2019-07-18T10:37:37
publisher: www.historicengland.org.uk
broader: Crime
narrower: Indecent Exposure
attribution name: Historic England
narrower: Voyeurism
in scheme: Heritage Crime Thesaurus
scope note: Sexual acts that take place in public or semi-public places.
narrower: Sex Groups
narrower: Bestiality
attribution URL: http://www.historicengland.org.uk
license: http://creativecommons.org/licenses/by/3.0

Drug Paraphanalia
type: Concept
scope note: The littering of sites with items used for and relating to the taking of illegal drugs such as syringes, cigarette rolling papers, crack pipes etc.
in scheme: Heritage Crime Thesaurus
publisher: www.historicengland.org.uk
broader: Littering
license: http://creativecommons.org/licenses/by/3.0
attribution name: Historic England
attribution URL: http://www.historicengland.org.uk
issued: 2019-07-18T10:37:37

Littering
type: Concept
in scheme: Heritage Crime Thesaurus
license: http://creativecommons.org/licenses/by/3.0
issued: 2019-07-18T10:37:37
broader: Anti Social Behavior (Environmental)
publisher: www.historicengland.org.uk
narrower: Sexual Paraphanalia
attribution URL: http://www.historicengland.org.uk
scope note: The action of throwing or dropping litter onto the ground rather than disposing of it properly.
broader: Environmental Crime
narrower: Drug Paraphanalia
attribution name: Historic England

Sexual Assault
type: Concept
publisher: www.historicengland.org.uk
license: http://creativecommons.org/licenses/by/3.0
alternative label: Rape
issued: 2019-07-18T10:37:37
in scheme: Heritage Crime Thesaurus
scope note: The intentional touching of another in a sexual manner where the perpetrator does not believe that the other party consents to their actions. Created by section 3 of the Sexual Offences Act 2003.
attribution name: Historic England
broader: Assault
broader: Public Sex Environment
attribution URL: http://www.historicengland.org.uk

Sex Groups
type: Concept
license: http://creativecommons.org/licenses/by/3.0
publisher: www.historicengland.org.uk
scope note: Groups of people who meet to perform group sex. Such activity can occur amongst people of all sexual orientations and genders. Group sex may take place in public for example, at nude beaches, secluded heritage assets or outdoor events or nightclubs.
broader: Public Sex Environment
attribution name: Historic England
in scheme: Heritage Crime Thesaurus
issued: 2019-07-18T10:37:37
alternative label: Dogging
attribution URL: http://www.historicengland.org.uk

Fly Posting
type: Concept
in scheme: Heritage Crime Thesaurus
issued: 2019-07-18T10:37:37
broader: Environmental Crime
related: Sexual Paraphanalia
publisher: www.historicengland.org.uk
attribution URL: http://www.historicengland.org.uk
license: http://creativecommons.org/licenses/by/3.0
attribution name: Historic England
scope note: The illegal placing of posters or flyers on private property without the consent of the property owner.
broader: Anti Social Behavior (Environmental)

Sexual Paraphanalia
type: Concept
publisher: www.historicengland.org.uk
attribution name: Historic England
in scheme: Heritage Crime Thesaurus
scope note: The littering of sites with items used for and relating to sexual acts, such as condoms and/or the advertisment of sexual services, such as calling cards etc.
broader: Littering
issued: 2019-07-18T10:37:37
related: Fly Posting
attribution URL: http://www.historicengland.org.uk
license: http://creativecommons.org/licenses/by/3.0
broader: Public Sex Environment

Prostitution
type: Concept
in scheme: Heritage Crime Thesaurus
license: http://creativecommons.org/licenses/by/3.0
scope note: The act of prostituting a person or oneself for sexual activity in return for payment.
attribution URL: http://www.historicengland.org.uk
issued: 2019-07-18T10:37:37
publisher: www.historicengland.org.uk
attribution name: Historic England
broader: Sex Working

Sex Working
type: Concept
narrower: Prostitution
attribution URL: http://www.historicengland.org.uk
issued: 2019-07-18T10:37:37
publisher: www.historicengland.org.uk
scope note: The provision of sex services by sex workers who are paid to engage in sexually explicit behavior with clients; for example prostitutes or escorts.
attribution name: Historic England
in scheme: Heritage Crime Thesaurus
license: http://creativecommons.org/licenses/by/3.0
narrower: Kerb Crawling
broader: Public Sex Environment

Unauthorized Acts
type: Concept
license: http://creativecommons.org/licenses/by/3.0
scope note: Any works that take place to a heritage asset that have not been authorized. Use more specific type where known.
narrower: Breach Of Condition
publisher: www.historicengland.org.uk
attribution name: Historic England
narrower: Unlicensed Excavation
in scheme: Heritage Crime Thesaurus
issued: 2019-07-18T10:37:37
attribution URL: http://www.historicengland.org.uk
narrower: False Certificate On Application For Consent
narrower: Non Compliance With Enforcement Notice
narrower: Unauthorized Metal Detecting
narrower: Contravention Of Discontinuance Of Use
narrower: Contravention Of Stop Notice
broader: Damage

Breach Of Condition
type: Concept
publisher: www.historicengland.org.uk
license: http://creativecommons.org/licenses/by/3.0
issued: 2019-07-18T10:37:37
in scheme: Heritage Crime Thesaurus
attribution name: Historic England
scope note: The act of breaching the conditions set when scheduled monument consent/listed building consent was granted.
broader: Unauthorized Acts
attribution URL: http://www.historicengland.org.uk

Unlicensed Excavation
type: Concept
in scheme: Heritage Crime Thesaurus
issued: 2019-07-18T10:37:37
publisher: www.historicengland.org.uk
attribution URL: http://www.historicengland.org.uk
license: http://creativecommons.org/licenses/by/3.0
scope note: The act of causing damage to and/or the destruction of archaeological deposits at a heritage assest by means of unauthorized excavation work.
attribution name: Historic England
broader: Unauthorized Acts

False Certificate On Application For Consent
type: Concept
publisher: www.historicengland.org.uk
issued: 2019-07-18T10:37:37
attribution URL: http://www.historicengland.org.uk
license: http://creativecommons.org/licenses/by/3.0
broader: Unauthorized Acts
attribution name: Historic England
in scheme: Heritage Crime Thesaurus

Non Compliance With Enforcement Notice
type: Concept
license: http://creativecommons.org/licenses/by/3.0
publisher: www.historicengland.org.uk
issued: 2019-07-18T10:37:37
broader: Unauthorized Acts
in scheme: Heritage Crime Thesaurus
attribution name: Historic England
attribution URL: http://www.historicengland.org.uk

Unauthorized Metal Detecting
type: Concept
attribution name: Historic England
issued: 2019-07-18T10:37:37
narrower: Nighthawking
in scheme: Heritage Crime Thesaurus
license: http://creativecommons.org/licenses/by/3.0
scope note: The use of a metal detector at a heritage asset. Use more specific type where known.
broader: Unauthorized Acts
narrower: Removal Of Artefacts
attribution URL: http://www.historicengland.org.uk
publisher: www.historicengland.org.uk
narrower: Non Removal Of Artefacts

Contravention Of Discontinuance Of Use
type: Concept
in scheme: Heritage Crime Thesaurus
publisher: www.historicengland.org.uk
license: http://creativecommons.org/licenses/by/3.0
attribution name: Historic England
attribution URL: http://www.historicengland.org.uk
issued: 2019-07-18T10:37:37
broader: Unauthorized Acts

Contravention Of Stop Notice
type: Concept
in scheme: Heritage Crime Thesaurus
license: http://creativecommons.org/licenses/by/3.0
scope note: The act of continuing on site works to either a scheduled monument or a listed building after notice has been given to cease all on site works.
broader: Unauthorized Acts
attribution URL: http://www.historicengland.org.uk
issued: 2019-07-18T10:37:37
publisher: www.historicengland.org.uk
attribution name: Historic England

Damage
type: Concept
publisher: www.historicengland.org.uk
narrower: Unauthorized Acts
issued: 2019-07-18T10:37:37
in scheme: Heritage Crime Thesaurus
narrower: Fire Setting
attribution name: Historic England
narrower: Graffiti
narrower: Removal Of Objects
broader: Crime
license: http://creativecommons.org/licenses/by/3.0
narrower: Criminal Damage
scope note: Activities that can result in physical damage to a heritage asset.
narrower: Inappropriate Use Of Vehicles
attribution URL: http://www.historicengland.org.uk

Illegal Parking
type: Concept
publisher: www.historicengland.org.uk
issued: 2019-07-18T10:37:37
broader: Anti Social Behavior (Environmental)
in scheme: Heritage Crime Thesaurus
attribution name: Historic England
attribution URL: http://www.historicengland.org.uk
scope note: The act of leaving a vehicle in a place where parking prohibited or at a time when parking is restricted.
broader: Inappropriate Use Of Vehicles
license: http://creativecommons.org/licenses/by/3.0

Removal Of Artefacts
type: Concept
issued: 2019-07-18T10:37:37
publisher: www.historicengland.org.uk
attribution URL: http://www.historicengland.org.uk
alternative label: Metal Detecting (Removal Of Artefacts)
alternative label: Artefact Theft
attribution name: Historic England
in scheme: Heritage Crime Thesaurus
scope note: The use of a metal detector at a heritage asset which has resulted in the location and removal of artefacts without consent.
broader: Unauthorized Metal Detecting
license: http://creativecommons.org/licenses/by/3.0

Serious Assault
type: Concept
issued: 2019-07-18T10:37:37
publisher: www.historicengland.org.uk
attribution URL: http://www.historicengland.org.uk
alternative label: Grievous Bodily Harm
attribution name: Historic England
license: http://creativecommons.org/licenses/by/3.0
in scheme: Heritage Crime Thesaurus
scope note: The unlawful infliction of bodily harm upon another person.
broader: Assault

Drug Misuse
type: Concept
broader: Substance Misuse
broader: Anti Social Behavior (Nuisance)
publisher: www.historicengland.org.uk
issued: 2019-07-18T10:37:37
scope note: The improper use of legal and/or illegal drugs with the intention to achieve intoxicating effects.
license: http://creativecommons.org/licenses/by/3.0
in scheme: Heritage Crime Thesaurus
related: Drug Dealing
attribution name: Historic England
attribution URL: http://www.historicengland.org.uk
broader: Nuisance Behaviour

Substance Misuse
type: Concept
publisher: www.historicengland.org.uk
attribution URL: http://www.historicengland.org.uk
narrower: Alcohol Misuse
attribution name: Historic England
in scheme: Heritage Crime Thesaurus
narrower: Drug Misuse
scope note: The improper use of legal and/or illegal substances with the intention to achieve intoxicating effects.
license: http://creativecommons.org/licenses/by/3.0
broader: Crime
issued: 2019-07-18T10:37:37

Drug Dealing
type: Concept
attribution URL: http://www.historicengland.org.uk
license: http://creativecommons.org/licenses/by/3.0
scope note: The illegal distribution and sale of substances which are subject to drug prohibition laws.
attribution name: Historic England
in scheme: Heritage Crime Thesaurus
broader: Anti Social Behavior (Nuisance)
issued: 2019-07-18T10:37:37
publisher: www.historicengland.org.uk
related: Drug Misuse
broader: Nuisance Behaviour

Crime
type: Concept
narrower: Anti Social Behavior
narrower: Public Sex Environment
narrower: Inappropriate Use Of Vehicles
issued: 2019-07-18T10:37:37
narrower: Nuisance Behaviour
attribution URL: http://www.historicengland.org.uk
narrower: Natural Environment
narrower: Intimidation
narrower: Unauthorized Access
narrower: Assault
top concept of: Heritage Crime Thesaurus
narrower: Environmental Crime
narrower: Illegal Artefact Dealing
license: http://creativecommons.org/licenses/by/3.0
publisher: www.historicengland.org.uk
attribution name: Historic England
narrower: Equipped To Commit Crime
narrower: Substance Misuse
in scheme: Heritage Crime Thesaurus
narrower: Damage

Anti Social Behavior
type: Concept
issued: 2019-07-18T10:37:37
publisher: www.historicengland.org.uk
attribution URL: http://www.historicengland.org.uk
attribution name: Historic England
in scheme: Heritage Crime Thesaurus
narrower: Anti Social Behavior (Personal)
license: http://creativecommons.org/licenses/by/3.0
narrower: Anti Social Behavior (Nuisance)
broader: Crime
narrower: Anti Social Behavior (Environmental)

Intimidation
type: Concept
license: http://creativecommons.org/licenses/by/3.0
narrower: Physical Intimidation
scope note: The action of causing a person to fear injury or harm.
broader: Crime
alternative label: Threatening Behaviour
narrower: Verbal Intimidation
issued: 2019-07-18T10:37:37
alternative label: Harrassment
publisher: www.historicengland.org.uk
attribution name: Historic England
in scheme: Heritage Crime Thesaurus
broader: Anti Social Behavior (Personal)
attribution URL: http://www.historicengland.org.uk

Illegal Artefact Dealing
type: Concept
issued: 2019-07-18T10:37:37
publisher: www.historicengland.org.uk
scope note: The act of trading in cultural property which has been stolen, illegally excavated or illegally imported.
attribution URL: http://www.historicengland.org.uk
license: http://creativecommons.org/licenses/by/3.0
broader: Crime
attribution name: Historic England
in scheme: Heritage Crime Thesaurus

Nighthawking
type: Concept
attribution name: Historic England
license: http://creativecommons.org/licenses/by/3.0
in scheme: Heritage Crime Thesaurus
broader: Unauthorized Metal Detecting
broader: Removal Of Objects
attribution URL: http://www.historicengland.org.uk
issued: 2019-07-18T10:37:37
publisher: www.historicengland.org.uk
scope note: The illicit use of metal detectors on archaeological sites, or sites of archaeological significance. An activity usually undertaken at night with the intention of stealing artifacts from the ground which are then often sold for personal profit.

Kerb Crawling
type: Concept
in scheme: Heritage Crime Thesaurus
publisher: www.historicengland.org.uk
license: http://creativecommons.org/licenses/by/3.0
attribution name: Historic England
attribution URL: http://www.historicengland.org.uk
issued: 2019-07-18T10:37:37
scope note: The practice of driving slowly by the side of a road with the intention of either harassing or soliciting prostitutes for sex.
broader: Sex Working

Bird Egg Removal
type: Concept
issued: 2019-07-18T10:37:37
publisher: www.historicengland.org.uk
attribution URL: http://www.historicengland.org.uk
scope note: The act of illegally removing the eggs of protected species of birds from their nests.
broader: Anti Social Behavior (Environmental)
attribution name: Historic England
in scheme: Heritage Crime Thesaurus
license: http://creativecommons.org/licenses/by/3.0
broader: Natural Environment

Off Road Motorcycle Use
type: Concept
issued: 2019-07-18T10:37:37
attribution URL: http://www.historicengland.org.uk
license: http://creativecommons.org/licenses/by/3.0
publisher: www.historicengland.org.uk
broader: Off Roading
scope note: The illicit riding of a motorcycle over natural terrain or archaeologically sensitive areas where such activity is not permitted.
attribution name: Historic England
in scheme: Heritage Crime Thesaurus

Off Roading
type: Concept
in scheme: Heritage Crime Thesaurus
attribution name: Historic England
attribution URL: http://www.historicengland.org.uk
narrower: Off Road Car Use
scope note: The illicit driving of a vehicle over natural terrain or archaeologically sensitive areas where such activity is not permitted.
license: http://creativecommons.org/licenses/by/3.0
publisher: www.historicengland.org.uk
issued: 2019-07-18T10:37:37
narrower: Off Road Bicycle Use
broader: Anti Social Behavior (Environmental)
narrower: Off Road Motorcycle Use
broader: Inappropriate Use Of Vehicles

Ritual Activity
type: Concept
attribution name: Historic England
in scheme: Heritage Crime Thesaurus
scope note: The practice of alternative religous activities.
broader: Anti Social Behavior (Nuisance)
broader: Nuisance Behaviour
issued: 2019-07-18T10:37:37
publisher: www.historicengland.org.uk
attribution URL: http://www.historicengland.org.uk
license: http://creativecommons.org/licenses/by/3.0

Public Defecation
type: Concept
attribution name: Historic England
issued: 2019-07-18T10:37:37
in scheme: Heritage Crime Thesaurus
broader: Anti Social Behavior (Environmental)
related: Public Urination
broader: Nuisance Behaviour
attribution URL: http://www.historicengland.org.uk
license: http://creativecommons.org/licenses/by/3.0
publisher: www.historicengland.org.uk
scope note: The passing of solid waste from the body in a public place.

Public Urination
type: Concept
license: http://creativecommons.org/licenses/by/3.0
publisher: www.historicengland.org.uk
related: Public Defecation
attribution name: Historic England
in scheme: Heritage Crime Thesaurus
issued: 2019-07-18T10:37:37
broader: Nuisance Behaviour
scope note: The passing of urine from the body in a public place.
attribution URL: http://www.historicengland.org.uk
broader: Anti Social Behavior (Environmental)

Non Removal Of Artefacts
type: Concept
attribution URL: http://www.historicengland.org.uk
issued: 2019-07-18T10:37:37
publisher: www.historicengland.org.uk
attribution name: Historic England
alternative label: Metal Detecting (Non Removal Of Artefacts)
in scheme: Heritage Crime Thesaurus
license: http://creativecommons.org/licenses/by/3.0
scope note: The use of a metal detector at a heritage asset which had yet to result in the location and removal of artefacts without consent.
broader: Unauthorized Metal Detecting

Flora Removal
type: Concept
license: http://creativecommons.org/licenses/by/3.0
in scheme: Heritage Crime Thesaurus
broader: Removal Of Objects
alternative label: Plant Removal
scope note: The deliberate and illegal removal of plants and flowers from a site; this can include unauthorized turf removal and the removal of plant life from wall caps.
publisher: www.historicengland.org.uk
attribution name: Historic England
attribution URL: http://www.historicengland.org.uk
broader: Anti Social Behavior (Environmental)
broader: Natural Environment
issued: 2019-07-18T10:37:37

Vehicle Noise
type: Concept
attribution URL: http://www.historicengland.org.uk
alternative label: Motorbike Noise
alternative label: Car Noise
issued: 2019-07-18T10:37:37
license: http://creativecommons.org/licenses/by/3.0
broader: Inappropriate Use Of Vehicles
in scheme: Heritage Crime Thesaurus
broader: Noise
scope note: Sound energy emanating from motor vehicles which is is constituted chiefly of engine, tire, aerodynamic and braking elements.
publisher: www.historicengland.org.uk
attribution name: Historic England

Noise
type: Concept
scope note: A loud, harsh, disturbing, disagreeable or intrusive sound.
publisher: www.historicengland.org.uk
issued: 2019-07-18T10:37:37
broader: Anti Social Behavior (Environmental)
in scheme: Heritage Crime Thesaurus
license: http://creativecommons.org/licenses/by/3.0
narrower: Vehicle Noise
attribution name: Historic England
attribution URL: http://www.historicengland.org.uk
broader: Nuisance Behaviour

Wildlife Disturbance
type: Concept
publisher: www.historicengland.org.uk
broader: Anti Social Behavior (Environmental)
attribution URL: http://www.historicengland.org.uk
license: http://creativecommons.org/licenses/by/3.0
issued: 2019-07-18T10:37:37
narrower: Bat Disturbance
attribution name: Historic England
broader: Natural Environment
narrower: Badger Disturbance
scope note: The act of causing damage to, or the destruction of, the nests or homes of animals.
in scheme: Heritage Crime Thesaurus

Bat Disturbance
type: Concept
publisher: www.historicengland.org.uk
attribution URL: http://www.historicengland.org.uk
scope note: To intentionally or recklessly disturb a bat in its roost or deliberately disturb a group of bats without a licence.
issued: 2019-07-18T10:37:37
attribution name: Historic England
in scheme: Heritage Crime Thesaurus
broader: Wildlife Disturbance
license: http://creativecommons.org/licenses/by/3.0

Firework Misuse
type: Concept
attribution URL: http://www.historicengland.org.uk
issued: 2019-07-18T10:37:37
publisher: www.historicengland.org.uk
attribution name: Historic England
broader: Nuisance Behaviour
in scheme: Heritage Crime Thesaurus
license: http://creativecommons.org/licenses/by/3.0
broader: Anti Social Behavior (Nuisance)
scope note: The irresponsible use of a firework and/or the use of fireworks as weapons ro harass and injure other individuals.

Unlicensed Rave
type: Concept
in scheme: Heritage Crime Thesaurus
attribution name: Historic England
attribution URL: http://www.historicengland.org.uk
scope note: A party "free" from the restrictions of the legal club scene where the people present create and enforce the rules. As a result drugs may be readily available and noise levels may be illegally high.
alternative label: Unlicensed Party
license: http://creativecommons.org/licenses/by/3.0
publisher: www.historicengland.org.uk
issued: 2019-07-18T10:37:37
broader: Nuisance Behaviour
broader: Anti Social Behavior (Environmental)

Alcohol Misuse
type: Concept
publisher: www.historicengland.org.uk
broader: Substance Misuse
attribution URL: http://www.historicengland.org.uk
broader: Nuisance Behaviour
broader: Anti Social Behavior (Nuisance)
attribution name: Historic England
scope note: The use of alcoholic beverages to achieve intoxication.
issued: 2019-07-18T10:37:37
narrower: Street Drinking
license: http://creativecommons.org/licenses/by/3.0
in scheme: Heritage Crime Thesaurus

Street Drinking
type: Concept
in scheme: Heritage Crime Thesaurus
publisher: www.historicengland.org.uk
license: http://creativecommons.org/licenses/by/3.0
attribution name: Historic England
scope note: The consumption of alcohol in public places.
attribution URL: http://www.historicengland.org.uk
issued: 2019-07-18T10:37:37
broader: Alcohol Misuse

Fire Setting
type: Concept
attribution URL: http://www.historicengland.org.uk
publisher: www.historicengland.org.uk
broader: Damage
issued: 2019-07-18T10:37:37
alternative label: Arson
in scheme: Heritage Crime Thesaurus
license: http://creativecommons.org/licenses/by/3.0
attribution name: Historic England
alternative label: Fireraising
scope note: The deliberate, malicious starting of fires.

Wildlife Trapping
type: Concept
attribution name: Historic England
broader: Natural Environment
in scheme: Heritage Crime Thesaurus
scope note: The illegal or unlicensed use of a device, such as a snare, foothold, cage trap or funnel trap etc, to remotely catch an animal.
attribution URL: http://www.historicengland.org.uk
broader: Anti Social Behavior (Environmental)
publisher: www.historicengland.org.uk
issued: 2019-07-18T10:37:37
license: http://creativecommons.org/licenses/by/3.0

Iron Theft
type: Concept
attribution URL: http://www.historicengland.org.uk
license: http://creativecommons.org/licenses/by/3.0
attribution name: Historic England
in scheme: Heritage Crime Thesaurus
broader: Metal Theft
alternative label: Ferrous Theft
issued: 2019-07-18T10:37:37
scope note: The illegal removal of iron external fittings or artefacts from heritage assets.
publisher: www.historicengland.org.uk

Copper Theft
type: Concept
issued: 2019-07-18T10:37:37
publisher: www.historicengland.org.uk
attribution URL: http://www.historicengland.org.uk
license: http://creativecommons.org/licenses/by/3.0
broader: Metal Theft
attribution name: Historic England
in scheme: Heritage Crime Thesaurus
scope note: The illegal removal of copper external fittings or artefacts from heritage assets.

Bestiality
type: Concept
publisher: www.historicengland.org.uk
license: http://creativecommons.org/licenses/by/3.0
issued: 2019-07-18T10:37:37
in scheme: Heritage Crime Thesaurus
attribution name: Historic England
broader: Public Sex Environment
attribution URL: http://www.historicengland.org.uk

Criminal Damage
type: Concept
license: http://creativecommons.org/licenses/by/3.0
publisher: www.historicengland.org.uk
attribution URL: http://www.historicengland.org.uk
scope note: The willful damage of a heritage asset.
alternative label: Vandalism
broader: Damage
issued: 2019-07-18T10:37:37
attribution name: Historic England
in scheme: Heritage Crime Thesaurus
related: Equipped To Commit Crime

Verbal Intimidation
type: Concept
publisher: www.historicengland.org.uk
attribution name: Historic England
attribution URL: http://www.historicengland.org.uk
scope note: The action of causing a person to fear injury or harm by using verbal abuse.
issued: 2019-07-18T10:37:37
broader: Intimidation
license: http://creativecommons.org/licenses/by/3.0
in scheme: Heritage Crime Thesaurus

Graffiti
type: Concept
publisher: www.historicengland.org.uk
related: Equipped To Commit Crime
attribution URL: http://www.historicengland.org.uk
attribution name: Historic England
in scheme: Heritage Crime Thesaurus
broader: Damage
license: http://creativecommons.org/licenses/by/3.0
issued: 2019-07-18T10:37:37
scope note: Casual scribbles or pictographs on walls, stones or other surfaces. In more recent times applied to humorous, satiric or obscene writings or drawings executed anonymously in public places.

Shotgun Misuse
type: Concept
issued: 2019-07-18T10:37:37
publisher: www.historicengland.org.uk
scope note: The improper use of a shotgun to threaten or inflict violence or harm.
attribution URL: http://www.historicengland.org.uk
license: http://creativecommons.org/licenses/by/3.0
attribution name: Historic England
in scheme: Heritage Crime Thesaurus
broader: Firearm Misuse

Lead Theft
type: Concept
attribution name: Historic England
attribution URL: http://www.historicengland.org.uk
publisher: www.historicengland.org.uk
license: http://creativecommons.org/licenses/by/3.0
scope note: The illegal removal of lead external fittings or artefacts from heritage assets.
issued: 2019-07-18T10:37:37
broader: Metal Theft
in scheme: Heritage Crime Thesaurus

Off Road Bicycle Use
type: Concept
publisher: www.historicengland.org.uk
attribution URL: http://www.historicengland.org.uk
broader: Off Roading
issued: 2019-07-18T10:37:37
attribution name: Historic England
scope note: The illicit riding of a bicycle over natural terrain or archaeologically sensitive areas where such activity is not permitted.
in scheme: Heritage Crime Thesaurus
license: http://creativecommons.org/licenses/by/3.0

Uncontrolled Animals
type: Concept
issued: 2019-07-18T10:37:37
broader: Anti Social Behavior (Environmental)
attribution URL: http://www.historicengland.org.uk
publisher: www.historicengland.org.uk
in scheme: Heritage Crime Thesaurus
scope note: Domestic animals that have either been left to roam uncontrolled by their owners or are allowed to cause distress to other members of the public whilst with their owner.
broader: Nuisance Behaviour
attribution name: Historic England
license: http://creativecommons.org/licenses/by/3.0

Minor Assault
type: Concept
attribution name: Historic England
attribution URL: http://www.historicengland.org.uk
publisher: www.historicengland.org.uk
license: http://creativecommons.org/licenses/by/3.0
scope note: The unlawful threat of violence or touching of another persion with intent to inflict bodily harm.
issued: 2019-07-18T10:37:37
broader: Assault
in scheme: Heritage Crime Thesaurus

Brass Theft
type: Concept
attribution name: Historic England
in scheme: Heritage Crime Thesaurus
broader: Metal Theft
scope note: The illegal removal of brass external fittings or artefacts from heritage assets.
issued: 2019-07-18T10:37:37
publisher: www.historicengland.org.uk
attribution URL: http://www.historicengland.org.uk
license: http://creativecommons.org/licenses/by/3.0

Off Road Car Use
type: Concept
scope note: The illicit driving of a car over natural terrain or archaeologically sensitive areas where such activity is not permitted.
issued: 2019-07-18T10:37:37
publisher: www.historicengland.org.uk
attribution URL: http://www.historicengland.org.uk
license: http://creativecommons.org/licenses/by/3.0
broader: Off Roading
attribution name: Historic England
in scheme: Heritage Crime Thesaurus

Fatal Assault
type: Concept
license: http://creativecommons.org/licenses/by/3.0
publisher: www.historicengland.org.uk
scope note: A crime of violence against another person that results in the death of the person being assaulted.
attribution name: Historic England
in scheme: Heritage Crime Thesaurus
broader: Assault
issued: 2019-07-18T10:37:37
attribution URL: http://www.historicengland.org.uk

Rifle Misuse
type: Concept
in scheme: Heritage Crime Thesaurus
attribution name: Historic England
attribution URL: http://www.historicengland.org.uk
broader: Firearm Misuse
scope note: The improper use of a rifle to threaten or inflict violence or harm.
license: http://creativecommons.org/licenses/by/3.0
publisher: www.historicengland.org.uk
issued: 2019-07-18T10:37:37

Indecent Exposure
type: Concept
license: http://creativecommons.org/licenses/by/3.0
attribution URL: http://www.historicengland.org.uk
scope note: Unseemly behaviour involving the public exposure of one's body in an indecent manner.
publisher: www.historicengland.org.uk
broader: Public Sex Environment
attribution name: Historic England
in scheme: Heritage Crime Thesaurus
alternative label: Flashing
issued: 2019-07-18T10:37:37

Physical Intimidation
type: Concept
publisher: www.historicengland.org.uk
attribution URL: http://www.historicengland.org.uk
scope note: The action of causing a person to fear injury or harm by threatening them with physical violence.
attribution name: Historic England
in scheme: Heritage Crime Thesaurus
license: http://creativecommons.org/licenses/by/3.0
broader: Intimidation
issued: 2019-07-18T10:37:37

Anti Social Behavior (Personal)
type: Concept
attribution URL: http://www.historicengland.org.uk
issued: 2019-07-18T10:37:37
publisher: www.historicengland.org.uk
attribution name: Historic England
in scheme: Heritage Crime Thesaurus
license: http://creativecommons.org/licenses/by/3.0
narrower: Intimidation
broader: Anti Social Behavior

Unauthorized Game Playing
type: Concept
in scheme: Heritage Crime Thesaurus
license: http://creativecommons.org/licenses/by/3.0
publisher: www.historicengland.org.uk
attribution name: Historic England
attribution URL: http://www.historicengland.org.uk
issued: 2019-07-18T10:37:37
scope note: The playing of games in a location where they are not permitted.
broader: Nuisance Behaviour
broader: Anti Social Behavior (Nuisance)

Assault (Visitor)
type: Concept
in scheme: Heritage Crime Thesaurus
publisher: www.historicengland.org.uk
license: http://creativecommons.org/licenses/by/3.0
broader: Assault
attribution name: Historic England
attribution URL: http://www.historicengland.org.uk
issued: 2019-07-18T10:37:37
scope note: A crime of violence against a visitor to a heritage site. Double index with the type and severity of the assault if known).

Wildlife Poisoning
type: Concept
broader: Natural Environment
attribution name: Historic England
attribution URL: http://www.historicengland.org.uk
publisher: www.historicengland.org.uk
license: http://creativecommons.org/licenses/by/3.0
broader: Anti Social Behavior (Environmental)
issued: 2019-07-18T10:37:37
scope note: The illegal or unlicensed poisoning of animals or birds.
in scheme: Heritage Crime Thesaurus