FISH Maritime Cargo Types Thesaurus
type: ConceptScheme
issued: 2021-11-19
license: http://creativecommons.org/licenses/by/3.0
attribution URL: http://www.historicengland.org.uk
attribution name: Historic England
publisher: www.historicengland.org.uk
description: Used to record the type of cargo being carried by a vessel on its final voyage and often found in association with the wreck site.
has top concept: Cargo

Wire
type: Concept
alternative label: Wire Cable
broader: Cordage
in scheme: FISH Maritime Cargo Types Thesaurus
issued: 2021-11-19T14:33:00
license: http://creativecommons.org/licenses/by/3.0
attribution URL: http://www.historicengland.org.uk
attribution name: Historic England
publisher: www.historicengland.org.uk
scope note: Thin rods or threads of metal formed by rolling or wire-drawing and used for a variety of purposes including electrical circuitry.

Cable
type: Concept
alternative label: Wire Cable
narrower: Submarine Cable
broader: Cordage
in scheme: FISH Maritime Cargo Types Thesaurus
issued: 2021-11-19T14:33:00
license: http://creativecommons.org/licenses/by/3.0
attribution URL: http://www.historicengland.org.uk
attribution name: Historic England
publisher: www.historicengland.org.uk
scope note: Originally used to describe very strong, often thick, rope made of metal or hemp. Now can be used for protective flexible tubing encasing wires such as telephone wire.

Submarine Cable
type: Concept
broader: Cable
in scheme: FISH Maritime Cargo Types Thesaurus
issued: 2021-11-19T14:33:00
license: http://creativecommons.org/licenses/by/3.0
attribution URL: http://www.historicengland.org.uk
attribution name: Historic England
publisher: www.historicengland.org.uk
scope note: A cable laid under the surface of the sea, often on the seabed, for various purposes including telecommunications.

Bone Meal
type: Concept
alternative label: Bone Dust
broader: Bones
in scheme: FISH Maritime Cargo Types Thesaurus
issued: 2021-11-19T14:33:00
license: http://creativecommons.org/licenses/by/3.0
attribution URL: http://www.historicengland.org.uk
attribution name: Historic England
publisher: www.historicengland.org.uk
scope note: Ground and crushed bones used as a fertilizer.

Guns
type: Concept
alternative label: Bronze Guns
alternative label: Iron Guns
narrower: Pistols
narrower: Cannon
narrower: Muskets
broader: Munitions
in scheme: FISH Maritime Cargo Types Thesaurus
issued: 2021-11-19T14:33:00
license: http://creativecommons.org/licenses/by/3.0
attribution URL: http://www.historicengland.org.uk
attribution name: Historic England
publisher: www.historicengland.org.uk
scope note: Weapons including portable firearms and large artillery pieces.

Pistols
type: Concept
broader: Guns
in scheme: FISH Maritime Cargo Types Thesaurus
issued: 2021-11-19T14:33:00
license: http://creativecommons.org/licenses/by/3.0
attribution URL: http://www.historicengland.org.uk
attribution name: Historic England
publisher: www.historicengland.org.uk
scope note: Small hand-held firearms.

Cannon
type: Concept
alternative label: Cannon For Scrap
broader: Guns
in scheme: FISH Maritime Cargo Types Thesaurus
issued: 2021-11-19T14:33:00
license: http://creativecommons.org/licenses/by/3.0
attribution URL: http://www.historicengland.org.uk
attribution name: Historic England
publisher: www.historicengland.org.uk
scope note: A piece of military ordnance, of sufficient size to require mounting and used for firing projectiles, traditionally cannon balls but more recently high explosive shells.

Muskets
type: Concept
broader: Guns
in scheme: FISH Maritime Cargo Types Thesaurus
issued: 2021-11-19T14:33:00
license: http://creativecommons.org/licenses/by/3.0
attribution URL: http://www.historicengland.org.uk
attribution name: Historic England
publisher: www.historicengland.org.uk
scope note: 17th to early 19th century muzzle-loaded long guns.

Timber Products
type: Concept
alternative label: Wood Products
narrower: Deals
narrower: Wood Chips
narrower: Potash
narrower: Bark
narrower: Wood Pulp
narrower: Firewood
narrower: Cork
narrower: Ashes
narrower: Dyewood
narrower: Pit Props
broader: Timber
in scheme: FISH Maritime Cargo Types Thesaurus
issued: 2021-11-19T14:33:00
license: http://creativecommons.org/licenses/by/3.0
attribution URL: http://www.historicengland.org.uk
attribution name: Historic England
publisher: www.historicengland.org.uk
scope note: Products manufactured from timber.

Wood Chips
type: Concept
broader: Timber Products
in scheme: FISH Maritime Cargo Types Thesaurus
issued: 2021-11-19T14:33:00
license: http://creativecommons.org/licenses/by/3.0
attribution URL: http://www.historicengland.org.uk
attribution name: Historic England
publisher: www.historicengland.org.uk
scope note: Small fragments of wood or bark.

Potash
type: Concept
broader: Timber Products
in scheme: FISH Maritime Cargo Types Thesaurus
issued: 2021-11-19T14:33:00
license: http://creativecommons.org/licenses/by/3.0
attribution URL: http://www.historicengland.org.uk
attribution name: Historic England
publisher: www.historicengland.org.uk
scope note: Potassium Carbonate obtained from the ashes of burnt plant matter and used as a fertilizer.

Bark
type: Concept
broader: Timber Products
in scheme: FISH Maritime Cargo Types Thesaurus
issued: 2021-11-19T14:33:00
license: http://creativecommons.org/licenses/by/3.0
attribution URL: http://www.historicengland.org.uk
attribution name: Historic England
publisher: www.historicengland.org.uk
scope note: The outer layer of tissue on a tree or woody plant, often used in the dyeing and tanning industries.

Wood Pulp
type: Concept
broader: Timber Products
in scheme: FISH Maritime Cargo Types Thesaurus
issued: 2021-11-19T14:33:00
license: http://creativecommons.org/licenses/by/3.0
attribution URL: http://www.historicengland.org.uk
attribution name: Historic England
publisher: www.historicengland.org.uk
scope note: Fibres of wood reduced chemically or mechanically to pulp for use in the manufacture of paper.

Firewood
type: Concept
broader: Timber Products
in scheme: FISH Maritime Cargo Types Thesaurus
issued: 2021-11-19T14:33:00
license: http://creativecommons.org/licenses/by/3.0
attribution URL: http://www.historicengland.org.uk
attribution name: Historic England
publisher: www.historicengland.org.uk
scope note: Wood which is used as fuel for fires.

Cork
type: Concept
broader: Timber Products
in scheme: FISH Maritime Cargo Types Thesaurus
issued: 2021-11-19T14:33:00
license: http://creativecommons.org/licenses/by/3.0
attribution URL: http://www.historicengland.org.uk
attribution name: Historic England
publisher: www.historicengland.org.uk
scope note: A light, buoyant material obtained from the cork oak. Cork is used in floats and as stoppers for bottles.

Ashes
type: Concept
alternative label: Cinders
broader: Timber Products
in scheme: FISH Maritime Cargo Types Thesaurus
issued: 2021-11-19T14:33:00
license: http://creativecommons.org/licenses/by/3.0
attribution URL: http://www.historicengland.org.uk
attribution name: Historic England
publisher: www.historicengland.org.uk
scope note: The powdery residue resulting from the combustion of a substance eg. wood and used for various manufacturing processes.

Pit Props
type: Concept
alternative label: Pit Wood
broader: Timber Products
in scheme: FISH Maritime Cargo Types Thesaurus
issued: 2021-11-19T14:33:00
license: http://creativecommons.org/licenses/by/3.0
attribution URL: http://www.historicengland.org.uk
attribution name: Historic England
publisher: www.historicengland.org.uk
scope note: A large block of wood used to support the roof of a mine.

Nuts
type: Concept
alternative label: Groundnuts
alternative label: Chestnuts
alternative label: Almonds
alternative label: Walnuts
broader: Fruit
in scheme: FISH Maritime Cargo Types Thesaurus
issued: 2021-11-19T14:33:00
license: http://creativecommons.org/licenses/by/3.0
attribution URL: http://www.historicengland.org.uk
attribution name: Historic England
publisher: www.historicengland.org.uk
scope note: A seed or fruit with a hard shell, often edible or used to produce oils.

Barrels
type: Concept
alternative label: Casks
broader: Containers
narrower: Barrel Headings
narrower: Barrel Hoops
narrower: Barrel Staves
in scheme: FISH Maritime Cargo Types Thesaurus
issued: 2021-11-19T14:33:00
license: http://creativecommons.org/licenses/by/3.0
attribution URL: http://www.historicengland.org.uk
attribution name: Historic England
publisher: www.historicengland.org.uk
scope note: Containers of cylindrical form, traditionally made of curved wooden staves bound together by hoops of metal. Also includes modern plastic and metal barrels.

Barrel Headings
type: Concept
broader: Barrels
in scheme: FISH Maritime Cargo Types Thesaurus
issued: 2021-11-19T14:33:00
license: http://creativecommons.org/licenses/by/3.0
attribution URL: http://www.historicengland.org.uk
attribution name: Historic England
publisher: www.historicengland.org.uk
scope note: The flat end of a barrel.

Barrel Hoops
type: Concept
broader: Barrels
in scheme: FISH Maritime Cargo Types Thesaurus
issued: 2021-11-19T14:33:00
license: http://creativecommons.org/licenses/by/3.0
attribution URL: http://www.historicengland.org.uk
attribution name: Historic England
publisher: www.historicengland.org.uk
scope note: Metal hoops used to hold the staves of barrels in position.

Barrel Staves
type: Concept
alternative label: Pipe Staves
broader: Barrels
in scheme: FISH Maritime Cargo Types Thesaurus
issued: 2021-11-19T14:33:00
license: http://creativecommons.org/licenses/by/3.0
attribution URL: http://www.historicengland.org.uk
attribution name: Historic England
publisher: www.historicengland.org.uk
scope note: Pieces of wood used to form the sides of barrels.

Patent Fuel
type: Concept
alternative label: Coal Patent Fuel
broader: Coal
in scheme: FISH Maritime Cargo Types Thesaurus
issued: 2021-11-19T14:33:00
license: http://creativecommons.org/licenses/by/3.0
attribution URL: http://www.historicengland.org.uk
attribution name: Historic England
publisher: www.historicengland.org.uk
scope note: A mixture of coals that have been formed into briquettes or blocks. This fuel took its name from the fact that it was under patent in the late nineteenth century.

Ivory
type: Concept
alternative label: Elephant Teeth
broader: Animal Products
narrower: Elephant Tusks
in scheme: FISH Maritime Cargo Types Thesaurus
issued: 2021-11-19T14:33:00
license: http://creativecommons.org/licenses/by/3.0
attribution URL: http://www.historicengland.org.uk
attribution name: Historic England
publisher: www.historicengland.org.uk
related: Animal Horn
scope note: A highly-prized, hard, white, fine-grained dentine constituting the main part of the teeth of walruses, hippopotami and elephants. Used in the manufacture of ornaments and piano keys.

Elephant Tusks
type: Concept
broader: Ivory
in scheme: FISH Maritime Cargo Types Thesaurus
issued: 2021-11-19T14:33:00
license: http://creativecommons.org/licenses/by/3.0
attribution URL: http://www.historicengland.org.uk
attribution name: Historic England
publisher: www.historicengland.org.uk
scope note: The large, pointed teeth, made of ivory, which are specially developed to protrude from the mouth of elephants.

Gold Coin
type: Concept
alternative label: Gold Specie
broader: Coin
in scheme: FISH Maritime Cargo Types Thesaurus
issued: 2021-11-19T14:33:00
license: http://creativecommons.org/licenses/by/3.0
attribution URL: http://www.historicengland.org.uk
attribution name: Historic England
publisher: www.historicengland.org.uk
scope note: Gold fashioned into coins for use as currency.

Animal Horn
type: Concept
alternative label: Horns
broader: Animal Products
in scheme: FISH Maritime Cargo Types Thesaurus
issued: 2021-11-19T14:33:00
license: http://creativecommons.org/licenses/by/3.0
attribution URL: http://www.historicengland.org.uk
attribution name: Historic England
publisher: www.historicengland.org.uk
related: Ivory
scope note: The bony outgrowths found on the heads of mammals used for display or combat used for a variety of purposes.

Logwood
type: Concept
alternative label: Log Wood
broader: Dyewood
in scheme: FISH Maritime Cargo Types Thesaurus
issued: 2021-11-19T14:33:00
license: http://creativecommons.org/licenses/by/3.0
attribution URL: http://www.historicengland.org.uk
attribution name: Historic England
publisher: www.historicengland.org.uk
scope note: The heartwood of a leguminous tree from which an extract is obtained. The extract being used for dyeing.

Military Equipment
type: Concept
alternative label: Military Stores
alternative label: Ordnance
alternative label: Ordnance Stores
broader: Cargo
narrower: Military Vehicles
narrower: Uniforms
narrower: Weapons
narrower: Naval Stores
narrower: Armour
narrower: Munitions
in scheme: FISH Maritime Cargo Types Thesaurus
issued: 2021-11-19T14:33:00
license: http://creativecommons.org/licenses/by/3.0
attribution URL: http://www.historicengland.org.uk
attribution name: Historic England
publisher: www.historicengland.org.uk
scope note: Equipment, including uniforms, small arms and field pieces, used by the armed forces.

Naval Stores
type: Concept
broader: Military Equipment
in scheme: FISH Maritime Cargo Types Thesaurus
issued: 2021-11-19T14:33:00
license: http://creativecommons.org/licenses/by/3.0
attribution URL: http://www.historicengland.org.uk
attribution name: Historic England
publisher: www.historicengland.org.uk
scope note: Goods and equipment used to supply a navy.

Ammunition
type: Concept
alternative label: Ordnance Ammunition
broader: Munitions
narrower: Shell Cases
narrower: Shot
narrower: Small Arms Ammunition
narrower: Cannon Balls
in scheme: FISH Maritime Cargo Types Thesaurus
issued: 2021-11-19T14:33:00
license: http://creativecommons.org/licenses/by/3.0
attribution URL: http://www.historicengland.org.uk
attribution name: Historic England
publisher: www.historicengland.org.uk
scope note: Military provisions, traditionally of all types but now used specifically for projectiles and propellants such eg. bullets and gunpowder.

Shell Cases
type: Concept
broader: Ammunition
in scheme: FISH Maritime Cargo Types Thesaurus
issued: 2021-11-19T14:33:00
license: http://creativecommons.org/licenses/by/3.0
attribution URL: http://www.historicengland.org.uk
attribution name: Historic England
publisher: www.historicengland.org.uk
scope note: Outer cases for ammunition shells, e.g. Howitzer shells; not "live" ammunition, i.e. either at the first stage of manufacture, or having been expended.

Shot
type: Concept
broader: Ammunition
in scheme: FISH Maritime Cargo Types Thesaurus
issued: 2021-11-19T14:33:00
license: http://creativecommons.org/licenses/by/3.0
attribution URL: http://www.historicengland.org.uk
attribution name: Historic England
publisher: www.historicengland.org.uk
scope note: Missiles, such as cannon balls and musket balls, designed to be discharged from a gun or cannon using an explosive propellant.

Small Arms Ammunition
type: Concept
broader: Ammunition
in scheme: FISH Maritime Cargo Types Thesaurus
issued: 2021-11-19T14:33:00
license: http://creativecommons.org/licenses/by/3.0
attribution URL: http://www.historicengland.org.uk
attribution name: Historic England
publisher: www.historicengland.org.uk
scope note: Ammunition manufactured for use in hand held firearms.

Cannon Balls
type: Concept
broader: Ammunition
in scheme: FISH Maritime Cargo Types Thesaurus
issued: 2021-11-19T14:33:00
license: http://creativecommons.org/licenses/by/3.0
attribution URL: http://www.historicengland.org.uk
attribution name: Historic England
publisher: www.historicengland.org.uk
scope note: Solid spherical objects, manufactured from stone or metal, fired from cannon.

Goods
type: Concept
alternative label: Small Goods
narrower: Hair
narrower: Canned Goods
narrower: Bagged Goods
narrower: Barrel Goods
narrower: Bale Goods
broader: General Cargo
in scheme: FISH Maritime Cargo Types Thesaurus
issued: 2021-11-19T14:33:00
license: http://creativecommons.org/licenses/by/3.0
attribution URL: http://www.historicengland.org.uk
attribution name: Historic England
publisher: www.historicengland.org.uk
scope note: General merchandise and saleable commodities. Use more specific type where known.

Bagged Goods
type: Concept
broader: Goods
in scheme: FISH Maritime Cargo Types Thesaurus
issued: 2021-11-19T14:33:00
license: http://creativecommons.org/licenses/by/3.0
attribution URL: http://www.historicengland.org.uk
attribution name: Historic England
publisher: www.historicengland.org.uk
scope note: Cargoes transported in sacks or bags, usually wheat, corn, flour, fruit, or coal. To be used only where the cargo is said to be "sacks" or "bags" of goods. Use specific term where known.

Barrel Goods
type: Concept
broader: Goods
in scheme: FISH Maritime Cargo Types Thesaurus
issued: 2021-11-19T14:33:00
license: http://creativecommons.org/licenses/by/3.0
attribution URL: http://www.historicengland.org.uk
attribution name: Historic England
publisher: www.historicengland.org.uk
scope note: Goods stowed in barrels and therefore indicating that the barrels were in use as containers with goods stored therein, rather than as cargo in their own right.

Bale Goods
type: Concept
broader: Goods
in scheme: FISH Maritime Cargo Types Thesaurus
issued: 2021-11-19T14:33:00
license: http://creativecommons.org/licenses/by/3.0
attribution URL: http://www.historicengland.org.uk
attribution name: Historic England
publisher: www.historicengland.org.uk
scope note: Merchandise wrapped in canvas and tightly bound with cords or hoops to form bales.

Canned Meat
type: Concept
alternative label: Tinned Meat
broader: Meat
broader: Canned Goods
in scheme: FISH Maritime Cargo Types Thesaurus
issued: 2021-11-19T14:33:00
license: http://creativecommons.org/licenses/by/3.0
attribution URL: http://www.historicengland.org.uk
attribution name: Historic England
publisher: www.historicengland.org.uk
scope note: Meat precooked and then sealed in cans made from steel, tin or aluminium plate to preserve it.

Silver Bullion
type: Concept
alternative label: Silver Bars
broader: Bullion
in scheme: FISH Maritime Cargo Types Thesaurus
issued: 2021-11-19T14:33:00
license: http://creativecommons.org/licenses/by/3.0
attribution URL: http://www.historicengland.org.uk
attribution name: Historic England
publisher: www.historicengland.org.uk
scope note: Solid bars or ingots of silver.

Coconuts
type: Concept
alternative label: Cocoa Nuts
broader: Fruit
in scheme: FISH Maritime Cargo Types Thesaurus
issued: 2021-11-19T14:33:00
license: http://creativecommons.org/licenses/by/3.0
attribution URL: http://www.historicengland.org.uk
attribution name: Historic England
publisher: www.historicengland.org.uk
scope note: Large, brown, hard-shelled seeds of the palm tree Cocos nucifera, the flesh and liquid contained within the shell can be eaten.

Canned Goods
type: Concept
alternative label: Tinned Goods
broader: Goods
broader: Food
narrower: Canned Meat
in scheme: FISH Maritime Cargo Types Thesaurus
issued: 2021-11-19T14:33:00
license: http://creativecommons.org/licenses/by/3.0
attribution URL: http://www.historicengland.org.uk
attribution name: Historic England
publisher: www.historicengland.org.uk
scope note: Goods, usually foodstuffs, which have been sealed inside canisters, usually made of tin or steel, to preserve them.

Spars
type: Concept
alternative label: Ships Spars
broader: Ship Fittings
broader: Construction Materials
in scheme: FISH Maritime Cargo Types Thesaurus
issued: 2021-11-19T14:33:00
license: http://creativecommons.org/licenses/by/3.0
attribution URL: http://www.historicengland.org.uk
attribution name: Historic England
publisher: www.historicengland.org.uk
scope note: Poles of timber, metal etc. used as masts, booms or yards on a vessel.

Timber
type: Concept
alternative label: Wood
narrower: Hardwood
narrower: Charcoal
narrower: Cedar
narrower: Deal
narrower: Oak
narrower: Quebracho
narrower: Pine
narrower: Boxwood
narrower: Mahogany
narrower: Ash
narrower: Elm
narrower: Teak
narrower: Lignum Vitae
narrower: Softwood
narrower: Ebony
narrower: Timber Products
narrower: Walnut
broader: Plants And Plant Products
in scheme: FISH Maritime Cargo Types Thesaurus
issued: 2021-11-19T14:33:00
license: http://creativecommons.org/licenses/by/3.0
attribution URL: http://www.historicengland.org.uk
attribution name: Historic England
publisher: www.historicengland.org.uk
scope note: Wood, cut and seasoned for use as a constructional material.

Hardwood
type: Concept
broader: Timber
in scheme: FISH Maritime Cargo Types Thesaurus
issued: 2021-11-19T14:33:00
license: http://creativecommons.org/licenses/by/3.0
attribution URL: http://www.historicengland.org.uk
attribution name: Historic England
publisher: www.historicengland.org.uk
scope note: Wood from non-coniferous trees, eg. oak, known for their hardness.

Cedar
type: Concept
broader: Timber
in scheme: FISH Maritime Cargo Types Thesaurus
issued: 2021-11-19T14:33:00
license: http://creativecommons.org/licenses/by/3.0
attribution URL: http://www.historicengland.org.uk
attribution name: Historic England
publisher: www.historicengland.org.uk
scope note: Durable wood from the cedar tree.

Deal
type: Concept
broader: Timber
in scheme: FISH Maritime Cargo Types Thesaurus
issued: 2021-11-19T14:33:00
license: http://creativecommons.org/licenses/by/3.0
attribution URL: http://www.historicengland.org.uk
attribution name: Historic England
publisher: www.historicengland.org.uk
scope note: Timber manufactured from fir or spruce trees.

Oak
type: Concept
broader: Timber
in scheme: FISH Maritime Cargo Types Thesaurus
issued: 2021-11-19T14:33:00
license: http://creativecommons.org/licenses/by/3.0
attribution URL: http://www.historicengland.org.uk
attribution name: Historic England
publisher: www.historicengland.org.uk
scope note: The wood from trees of the type Quercus.

Quebracho
type: Concept
broader: Timber
in scheme: FISH Maritime Cargo Types Thesaurus
issued: 2021-11-19T14:33:00
license: http://creativecommons.org/licenses/by/3.0
attribution URL: http://www.historicengland.org.uk
attribution name: Historic England
publisher: www.historicengland.org.uk
scope note: The bark and wood of trees of the genus Aspidosperma used to produce tannin.

Pine
type: Concept
broader: Timber
in scheme: FISH Maritime Cargo Types Thesaurus
issued: 2021-11-19T14:33:00
license: http://creativecommons.org/licenses/by/3.0
attribution URL: http://www.historicengland.org.uk
attribution name: Historic England
publisher: www.historicengland.org.uk
scope note: Softwood obtained from trees of the genus Pinus, often used for the manufacture of furniture.

Boxwood
type: Concept
broader: Timber
in scheme: FISH Maritime Cargo Types Thesaurus
issued: 2021-11-19T14:33:00
license: http://creativecommons.org/licenses/by/3.0
attribution URL: http://www.historicengland.org.uk
attribution name: Historic England
publisher: www.historicengland.org.uk
scope note: The hard, close-grained wood of the Box or similar trees.

Mahogany
type: Concept
broader: Timber
in scheme: FISH Maritime Cargo Types Thesaurus
issued: 2021-11-19T14:33:00
license: http://creativecommons.org/licenses/by/3.0
attribution URL: http://www.historicengland.org.uk
attribution name: Historic England
publisher: www.historicengland.org.uk
scope note: Hard wood, reddish-brown in colour with a fine-grain often used in the manufacture of furniture.

Ash
type: Concept
broader: Timber
in scheme: FISH Maritime Cargo Types Thesaurus
issued: 2021-11-19T14:33:00
license: http://creativecommons.org/licenses/by/3.0
attribution URL: http://www.historicengland.org.uk
attribution name: Historic England
publisher: www.historicengland.org.uk
scope note: The powdery residue left after the combustion of substances, especially wood and paper.

Elm
type: Concept
broader: Timber
in scheme: FISH Maritime Cargo Types Thesaurus
issued: 2021-11-19T14:33:00
license: http://creativecommons.org/licenses/by/3.0
attribution URL: http://www.historicengland.org.uk
attribution name: Historic England
publisher: www.historicengland.org.uk
scope note: Wood from the elm tree.

Teak
type: Concept
broader: Timber
in scheme: FISH Maritime Cargo Types Thesaurus
issued: 2021-11-19T14:33:00
license: http://creativecommons.org/licenses/by/3.0
attribution URL: http://www.historicengland.org.uk
attribution name: Historic England
publisher: www.historicengland.org.uk
scope note: An exotic hardwood with great strength and durability.

Lignum Vitae
type: Concept
broader: Timber
in scheme: FISH Maritime Cargo Types Thesaurus
issued: 2021-11-19T14:33:00
license: http://creativecommons.org/licenses/by/3.0
attribution URL: http://www.historicengland.org.uk
attribution name: Historic England
publisher: www.historicengland.org.uk
scope note: The hard, heavy wood obtained from plants of the genus Guaiacum.

Softwood
type: Concept
broader: Timber
in scheme: FISH Maritime Cargo Types Thesaurus
issued: 2021-11-19T14:33:00
license: http://creativecommons.org/licenses/by/3.0
attribution URL: http://www.historicengland.org.uk
attribution name: Historic England
publisher: www.historicengland.org.uk
scope note: Wood which is soft or easily cut, particularly the wood of coniferous trees.

Ebony
type: Concept
broader: Timber
in scheme: FISH Maritime Cargo Types Thesaurus
issued: 2021-11-19T14:33:00
license: http://creativecommons.org/licenses/by/3.0
attribution URL: http://www.historicengland.org.uk
attribution name: Historic England
publisher: www.historicengland.org.uk
scope note: The hard, black, heavy wood of various tropical trees native to Africa and Asia, used in furniture manufacture and for making ornaments.

Walnut
type: Concept
broader: Timber
in scheme: FISH Maritime Cargo Types Thesaurus
issued: 2021-11-19T14:33:00
license: http://creativecommons.org/licenses/by/3.0
attribution URL: http://www.historicengland.org.uk
attribution name: Historic England
publisher: www.historicengland.org.uk
scope note: Timber from trees of the genus Juglans, used for the manufacture of furniture

Paving Stones
type: Concept
alternative label: Flagstones
broader: Stone Products
in scheme: FISH Maritime Cargo Types Thesaurus
issued: 2021-11-19T14:33:00
license: http://creativecommons.org/licenses/by/3.0
attribution URL: http://www.historicengland.org.uk
attribution name: Historic England
publisher: www.historicengland.org.uk
scope note: Flat stones used to create flat surfaces, e.g. pavements.

Silver Coin
type: Concept
alternative label: Silver Specie
broader: Coin
in scheme: FISH Maritime Cargo Types Thesaurus
issued: 2021-11-19T14:33:00
license: http://creativecommons.org/licenses/by/3.0
attribution URL: http://www.historicengland.org.uk
attribution name: Historic England
publisher: www.historicengland.org.uk
scope note: Silver fashioned into coin for use as currency.

Coin
type: Concept
alternative label: Specie
narrower: Florins
narrower: Gold Coin
narrower: Silver Coin
broader: Bullion And Coin
in scheme: FISH Maritime Cargo Types Thesaurus
issued: 2021-11-19T14:33:00
license: http://creativecommons.org/licenses/by/3.0
attribution URL: http://www.historicengland.org.uk
attribution name: Historic England
publisher: www.historicengland.org.uk
scope note: Pieces of metal money usually small in size and circular in design. Manufacture from a variety of metals including gold and silver but more recently manufactured from base metals and alloys.

Florins
type: Concept
broader: Coin
in scheme: FISH Maritime Cargo Types Thesaurus
issued: 2021-11-19T14:33:00
license: http://creativecommons.org/licenses/by/3.0
attribution URL: http://www.historicengland.org.uk
attribution name: Historic England
publisher: www.historicengland.org.uk
scope note: Originally gold coins issued in Florence, but later used for various coins issued on the continent. In modern Britain, the two shilling piece.

String
type: Concept
alternative label: Twine
alternative label: Packthread
alternative label: Thread
broader: Manufactured Goods
in scheme: FISH Maritime Cargo Types Thesaurus
issued: 2021-11-19T14:33:00
license: http://creativecommons.org/licenses/by/3.0
attribution URL: http://www.historicengland.org.uk
attribution name: Historic England
publisher: www.historicengland.org.uk
related: Cotton
related: Hemp
scope note: Line, cord or thread, especially that used for tying up parcels, etc. Also use for "twine", i.e. twisted thread, for the same purpose, and medieval equivalents, e.g. "packthread".

Gravestones
type: Concept
alternative label: Tombstones
alternative label: Headstones
broader: Stone Blocks
in scheme: FISH Maritime Cargo Types Thesaurus
issued: 2021-11-19T14:33:00
license: http://creativecommons.org/licenses/by/3.0
attribution URL: http://www.historicengland.org.uk
attribution name: Historic England
publisher: www.historicengland.org.uk
scope note: Carved stones used for marking a grave.

Bicycles
type: Concept
alternative label: Bikes
broader: Vehicles
in scheme: FISH Maritime Cargo Types Thesaurus
issued: 2021-11-19T14:33:00
license: http://creativecommons.org/licenses/by/3.0
attribution URL: http://www.historicengland.org.uk
attribution name: Historic England
publisher: www.historicengland.org.uk
scope note: Two-wheeled vehicles for personal transport with pedals for propulsion by the rider.

Pumice
type: Concept
alternative label: Pumice Stones
broader: Stone
in scheme: FISH Maritime Cargo Types Thesaurus
issued: 2021-11-19T14:33:00
license: http://creativecommons.org/licenses/by/3.0
attribution URL: http://www.historicengland.org.uk
attribution name: Historic England
publisher: www.historicengland.org.uk
scope note: A light porous acid volcanic rock used for scouring and, in powdered form, as an abrasive and for polishing. Also used to make lightweight concrete.

Sulphuric Acid
type: Concept
alternative label: Vitriol
broader: Acid
in scheme: FISH Maritime Cargo Types Thesaurus
issued: 2021-11-19T14:33:00
license: http://creativecommons.org/licenses/by/3.0
attribution URL: http://www.historicengland.org.uk
attribution name: Historic England
publisher: www.historicengland.org.uk
scope note: Corrosive, dense, oily acid, usually in aqueous solution, used in the chemical industry.

Intermodal Containers
type: Concept
alternative label: Shipping Containers
broader: Containers
in scheme: FISH Maritime Cargo Types Thesaurus
issued: 2021-11-19T14:33:00
license: http://creativecommons.org/licenses/by/3.0
attribution URL: http://www.historicengland.org.uk
attribution name: Historic England
publisher: www.historicengland.org.uk
scope note: A standardized rectangular steel container used for the transportation of goods by road rail and sea.

Ochre
type: Concept
broader: Minerals
broader: Pigment
in scheme: FISH Maritime Cargo Types Thesaurus
issued: 2021-11-19T14:33:00
license: http://creativecommons.org/licenses/by/3.0
attribution URL: http://www.historicengland.org.uk
attribution name: Historic England
publisher: www.historicengland.org.uk
scope note: An earth derived pigment.

Minerals
type: Concept
narrower: Ochre
narrower: Soda
narrower: Barytes
narrower: Gemstones
narrower: Chalk
narrower: Phosphate Rock
narrower: Clay
narrower: Copper Pyrites
narrower: Saltpetre
narrower: Sulphates
narrower: Chinastone
narrower: Fullers Earth
narrower: Pyrites
narrower: Manganese
narrower: Asbestos
narrower: Ore
narrower: Stone
narrower: Cement
narrower: Graphite
narrower: Copperas
broader: Cargo
in scheme: FISH Maritime Cargo Types Thesaurus
issued: 2021-11-19T14:33:00
license: http://creativecommons.org/licenses/by/3.0
attribution URL: http://www.historicengland.org.uk
attribution name: Historic England
publisher: www.historicengland.org.uk
scope note: Naturally occuring substances eg. coal and salt, obtained by mining.

Soda
type: Concept
broader: Minerals
in scheme: FISH Maritime Cargo Types Thesaurus
issued: 2021-11-19T14:33:00
license: http://creativecommons.org/licenses/by/3.0
attribution URL: http://www.historicengland.org.uk
attribution name: Historic England
publisher: www.historicengland.org.uk
scope note: Sodium carbonate, usually derived from common salt, used for a variety of purposes including the manufacture of glass and soap.

Barytes
type: Concept
broader: Minerals
in scheme: FISH Maritime Cargo Types Thesaurus
issued: 2021-11-19T14:33:00
license: http://creativecommons.org/licenses/by/3.0
attribution URL: http://www.historicengland.org.uk
attribution name: Historic England
publisher: www.historicengland.org.uk
scope note: Sulphate of Barium

Chalk
type: Concept
broader: Minerals
in scheme: FISH Maritime Cargo Types Thesaurus
issued: 2021-11-19T14:33:00
license: http://creativecommons.org/licenses/by/3.0
attribution URL: http://www.historicengland.org.uk
attribution name: Historic England
publisher: www.historicengland.org.uk
scope note: Soft limestone consisting almost entirely of calcite.

Phosphate Rock
type: Concept
broader: Minerals
in scheme: FISH Maritime Cargo Types Thesaurus
issued: 2021-11-19T14:33:00
license: http://creativecommons.org/licenses/by/3.0
attribution URL: http://www.historicengland.org.uk
attribution name: Historic England
publisher: www.historicengland.org.uk
scope note: Rock containing a high proportion of calcium phosphate.

Copper Pyrites
type: Concept
broader: Minerals
in scheme: FISH Maritime Cargo Types Thesaurus
issued: 2021-11-19T14:33:00
license: http://creativecommons.org/licenses/by/3.0
attribution URL: http://www.historicengland.org.uk
attribution name: Historic England
publisher: www.historicengland.org.uk
scope note: A mineral of copper, iron and sulphur and is the main ore of copper.

Saltpetre
type: Concept
broader: Minerals
in scheme: FISH Maritime Cargo Types Thesaurus
issued: 2021-11-19T14:33:00
license: http://creativecommons.org/licenses/by/3.0
attribution URL: http://www.historicengland.org.uk
attribution name: Historic England
publisher: www.historicengland.org.uk
scope note: Potassium nitrate

Chinastone
type: Concept
broader: Minerals
in scheme: FISH Maritime Cargo Types Thesaurus
issued: 2021-11-19T14:33:00
license: http://creativecommons.org/licenses/by/3.0
attribution URL: http://www.historicengland.org.uk
attribution name: Historic England
publisher: www.historicengland.org.uk
scope note: Partially decomposed granite used to produce a glaze for porcelain.

Pyrites
type: Concept
broader: Minerals
in scheme: FISH Maritime Cargo Types Thesaurus
issued: 2021-11-19T14:33:00
license: http://creativecommons.org/licenses/by/3.0
attribution URL: http://www.historicengland.org.uk
attribution name: Historic England
publisher: www.historicengland.org.uk
scope note: Traditionally a mineral that could be used for striking fire but now a term commonly used to refer to various sulphides, especially iron disulphide.

Manganese
type: Concept
broader: Minerals
in scheme: FISH Maritime Cargo Types Thesaurus
issued: 2021-11-19T14:33:00
license: http://creativecommons.org/licenses/by/3.0
attribution URL: http://www.historicengland.org.uk
attribution name: Historic England
publisher: www.historicengland.org.uk
scope note: A hard metallic element used in steels and magnetic alloys. Compounds containing manganese are used in glass-making and other industrial processes.

Asbestos
type: Concept
broader: Minerals
in scheme: FISH Maritime Cargo Types Thesaurus
issued: 2021-11-19T14:33:00
license: http://creativecommons.org/licenses/by/3.0
attribution URL: http://www.historicengland.org.uk
attribution name: Historic England
publisher: www.historicengland.org.uk
scope note: A fibrous silicate mineral used to manufacture incombustible items.

Cement
type: Concept
broader: Minerals
in scheme: FISH Maritime Cargo Types Thesaurus
issued: 2021-11-19T14:33:00
license: http://creativecommons.org/licenses/by/3.0
attribution URL: http://www.historicengland.org.uk
attribution name: Historic England
publisher: www.historicengland.org.uk
scope note: Powder mixed with water and applied as a paste for binding stones and bricks or for forming floors, walls etc.

Graphite
type: Concept
broader: Minerals
in scheme: FISH Maritime Cargo Types Thesaurus
issued: 2021-11-19T14:33:00
license: http://creativecommons.org/licenses/by/3.0
attribution URL: http://www.historicengland.org.uk
attribution name: Historic England
publisher: www.historicengland.org.uk
scope note: One of the allotropes of carbon, commonly used in pencils.

Copperas
type: Concept
broader: Minerals
in scheme: FISH Maritime Cargo Types Thesaurus
issued: 2021-11-19T14:33:00
license: http://creativecommons.org/licenses/by/3.0
attribution URL: http://www.historicengland.org.uk
attribution name: Historic England
publisher: www.historicengland.org.uk
scope note: Sulphates, used in medicine and to colour inks.

Piece Goods
type: Concept
broader: Cloth
in scheme: FISH Maritime Cargo Types Thesaurus
issued: 2021-11-19T14:33:00
license: http://creativecommons.org/licenses/by/3.0
attribution URL: http://www.historicengland.org.uk
attribution name: Historic England
publisher: www.historicengland.org.uk
scope note: Cloth that has been woven in fixed lengths for sale.

Cloth
type: Concept
narrower: Piece Goods
narrower: Flannel
narrower: Nankeen
narrower: Muslin
broader: Textiles
in scheme: FISH Maritime Cargo Types Thesaurus
issued: 2021-11-19T14:33:00
license: http://creativecommons.org/licenses/by/3.0
attribution URL: http://www.historicengland.org.uk
attribution name: Historic England
publisher: www.historicengland.org.uk
scope note: Woven or felted fabric used in the manufacture of garments, tablecloths, towels etc.

Flannel
type: Concept
broader: Cloth
in scheme: FISH Maritime Cargo Types Thesaurus
issued: 2021-11-19T14:33:00
license: http://creativecommons.org/licenses/by/3.0
attribution URL: http://www.historicengland.org.uk
attribution name: Historic England
publisher: www.historicengland.org.uk
scope note: Soft, loose-textured, woollen or man-made fabric.

Nankeen
type: Concept
broader: Cloth
in scheme: FISH Maritime Cargo Types Thesaurus
issued: 2021-11-19T14:33:00
license: http://creativecommons.org/licenses/by/3.0
attribution URL: http://www.historicengland.org.uk
attribution name: Historic England
publisher: www.historicengland.org.uk
scope note: A type of cotton cloth of a pale yellow colour.

Muslin
type: Concept
broader: Cloth
in scheme: FISH Maritime Cargo Types Thesaurus
issued: 2021-11-19T14:33:00
license: http://creativecommons.org/licenses/by/3.0
attribution URL: http://www.historicengland.org.uk
attribution name: Historic England
publisher: www.historicengland.org.uk
scope note: Fine cotton fabric of a delicate weave.

Biscuit
type: Concept
broader: Food
in scheme: FISH Maritime Cargo Types Thesaurus
issued: 2021-11-19T14:33:00
license: http://creativecommons.org/licenses/by/3.0
attribution URL: http://www.historicengland.org.uk
attribution name: Historic England
publisher: www.historicengland.org.uk
scope note: Traditionally, pieces of unleavened cake or bread usually small in size and dry, crisp and hard.

Food
type: Concept
narrower: Biscuit
narrower: Meat
narrower: Preserves
narrower: Bread
narrower: Chocolate
narrower: Fruit
narrower: Spices And Seasonings
narrower: Hops
narrower: Liquorice
narrower: Dairy Produce
narrower: Fish
narrower: Bottled Goods
narrower: Palm Kernels
narrower: Arrowroot
narrower: Coffee
narrower: Canned Goods
narrower: Sugar
narrower: Cocoa
narrower: Tea
narrower: Vegetables
narrower: Roe
narrower: Cereal
narrower: Liquids
broader: Cargo
in scheme: FISH Maritime Cargo Types Thesaurus
issued: 2021-11-19T14:33:00
license: http://creativecommons.org/licenses/by/3.0
attribution URL: http://www.historicengland.org.uk
attribution name: Historic England
publisher: www.historicengland.org.uk
scope note: Includes raw and processed.

Preserves
type: Concept
broader: Food
in scheme: FISH Maritime Cargo Types Thesaurus
issued: 2021-11-19T14:33:00
license: http://creativecommons.org/licenses/by/3.0
attribution URL: http://www.historicengland.org.uk
attribution name: Historic England
publisher: www.historicengland.org.uk
scope note: Traditionally any food preserved by boiling with sugar, salting, pickling etc. Nowadays used specifically for fruit which has been preserved with sugar.

Bread
type: Concept
broader: Food
in scheme: FISH Maritime Cargo Types Thesaurus
issued: 2021-11-19T14:33:00
license: http://creativecommons.org/licenses/by/3.0
attribution URL: http://www.historicengland.org.uk
attribution name: Historic England
publisher: www.historicengland.org.uk
scope note: A staple foodstuff made with flour, water and usually yeast, which is kneaded and then baked. Can include unleavened (no yeast) varieties.

Chocolate
type: Concept
broader: Food
in scheme: FISH Maritime Cargo Types Thesaurus
issued: 2021-11-19T14:33:00
license: http://creativecommons.org/licenses/by/3.0
attribution URL: http://www.historicengland.org.uk
attribution name: Historic England
publisher: www.historicengland.org.uk
scope note: Paste or cake of the fruit of the cacao-tree, sweetened with other substances and used to make beverages or confectionery.

Hops
type: Concept
broader: Food
in scheme: FISH Maritime Cargo Types Thesaurus
issued: 2021-11-19T14:33:00
license: http://creativecommons.org/licenses/by/3.0
attribution URL: http://www.historicengland.org.uk
attribution name: Historic England
publisher: www.historicengland.org.uk
scope note: Conelike spikes of the hop plant used in the brewing industry to give a bitter flavour to beer and malt liquors.

Bottled Goods
type: Concept
broader: Food
in scheme: FISH Maritime Cargo Types Thesaurus
issued: 2021-11-19T14:33:00
license: http://creativecommons.org/licenses/by/3.0
attribution URL: http://www.historicengland.org.uk
attribution name: Historic England
publisher: www.historicengland.org.uk
scope note: Goods, usually foodstuffs, preserved in glass bottles, jars, etc. Examples are bottled fruit, pickled onions, jam, honey.

Arrowroot
type: Concept
broader: Food
in scheme: FISH Maritime Cargo Types Thesaurus
issued: 2021-11-19T14:33:00
license: http://creativecommons.org/licenses/by/3.0
attribution URL: http://www.historicengland.org.uk
attribution name: Historic England
publisher: www.historicengland.org.uk
scope note: A pure starch obtained from the tubers of the plant Maranta arundinacea used in cookery as a thickening agent.

Coffee
type: Concept
broader: Food
in scheme: FISH Maritime Cargo Types Thesaurus
issued: 2021-11-19T14:33:00
license: http://creativecommons.org/licenses/by/3.0
attribution URL: http://www.historicengland.org.uk
attribution name: Historic England
publisher: www.historicengland.org.uk
scope note: The beans, or powder resulting from grinding the beans, of shrubs of the genus Coffea. The powder is used to make the drink Coffee.

Sugar
type: Concept
broader: Food
in scheme: FISH Maritime Cargo Types Thesaurus
issued: 2021-11-19T14:33:00
license: http://creativecommons.org/licenses/by/3.0
attribution URL: http://www.historicengland.org.uk
attribution name: Historic England
publisher: www.historicengland.org.uk
scope note: A sweet, crystalline subtance obtained from sugar beet or sugar cane and used in cooking, brewing etc.

Cocoa
type: Concept
broader: Food
in scheme: FISH Maritime Cargo Types Thesaurus
issued: 2021-11-19T14:33:00
license: http://creativecommons.org/licenses/by/3.0
attribution URL: http://www.historicengland.org.uk
attribution name: Historic England
publisher: www.historicengland.org.uk
scope note: Powder produced by grinding cacao beans, used as the main ingredient for the drink Cocoa.

Tea
type: Concept
broader: Food
in scheme: FISH Maritime Cargo Types Thesaurus
issued: 2021-11-19T14:33:00
license: http://creativecommons.org/licenses/by/3.0
attribution URL: http://www.historicengland.org.uk
attribution name: Historic England
publisher: www.historicengland.org.uk
scope note: Dried leaves from the plant Camellia sinensis, which is used to make a drink by infusing the leaves in boiling water.

Roe
type: Concept
broader: Food
in scheme: FISH Maritime Cargo Types Thesaurus
issued: 2021-11-19T14:33:00
license: http://creativecommons.org/licenses/by/3.0
attribution URL: http://www.historicengland.org.uk
attribution name: Historic England
publisher: www.historicengland.org.uk
scope note: Fish eggs, e.g. from cod or, for example, caviar.

Blubber
type: Concept
broader: Animal Products
in scheme: FISH Maritime Cargo Types Thesaurus
issued: 2021-11-19T14:33:00
license: http://creativecommons.org/licenses/by/3.0
attribution URL: http://www.historicengland.org.uk
attribution name: Historic England
publisher: www.historicengland.org.uk
related: Tallow
related: Whale Oil
scope note: The fat removed from the carcass of a whale or seal and used in the manufacture of cosmetics and as a fuel for tallow lamps.

Animal Products
type: Concept
narrower: Blubber
narrower: Ivory
narrower: Animal Skins
narrower: Whale Oil
narrower: Wool
narrower: Grease
narrower: Coral
narrower: Bones
narrower: Leather
narrower: Antlers
narrower: Train Oil
narrower: Wax
narrower: Animal Hair
narrower: Tallow
narrower: Sponges
narrower: Animal Horn
broader: Animals And Animal Products
in scheme: FISH Maritime Cargo Types Thesaurus
issued: 2021-11-19T14:33:00
license: http://creativecommons.org/licenses/by/3.0
attribution URL: http://www.historicengland.org.uk
attribution name: Historic England
publisher: www.historicengland.org.uk
scope note: Products derived from the carcasses or hides of animals. Includes bone and ivory products, blubber and grease but not meat.

Grease
type: Concept
broader: Animal Products
in scheme: FISH Maritime Cargo Types Thesaurus
issued: 2021-11-19T14:33:00
license: http://creativecommons.org/licenses/by/3.0
attribution URL: http://www.historicengland.org.uk
attribution name: Historic England
publisher: www.historicengland.org.uk
scope note: Fat from an animal used to lubricate objects.

Coral
type: Concept
broader: Animal Products
in scheme: FISH Maritime Cargo Types Thesaurus
issued: 2021-11-19T14:33:00
license: http://creativecommons.org/licenses/by/3.0
attribution URL: http://www.historicengland.org.uk
attribution name: Historic England
publisher: www.historicengland.org.uk
scope note: A calcareous, hard substance, the external skeleton of marine polyps, used in the manufacture of jewellery.

Leather
type: Concept
broader: Animal Products
in scheme: FISH Maritime Cargo Types Thesaurus
issued: 2021-11-19T14:33:00
license: http://creativecommons.org/licenses/by/3.0
attribution URL: http://www.historicengland.org.uk
attribution name: Historic England
publisher: www.historicengland.org.uk
scope note: Animal skins which have been treated by tanning or similar.

Train Oil
type: Concept
broader: Animal Products
in scheme: FISH Maritime Cargo Types Thesaurus
issued: 2021-11-19T14:33:00
license: http://creativecommons.org/licenses/by/3.0
attribution URL: http://www.historicengland.org.uk
attribution name: Historic England
publisher: www.historicengland.org.uk
scope note: Product of boiled blubber

Wax
type: Concept
broader: Animal Products
in scheme: FISH Maritime Cargo Types Thesaurus
issued: 2021-11-19T14:33:00
license: http://creativecommons.org/licenses/by/3.0
attribution URL: http://www.historicengland.org.uk
attribution name: Historic England
publisher: www.historicengland.org.uk
scope note: A malleable water repellant substance created by animals or as a coating to parts of plants.

Sponges
type: Concept
broader: Animal Products
in scheme: FISH Maritime Cargo Types Thesaurus
issued: 2021-11-19T14:33:00
license: http://creativecommons.org/licenses/by/3.0
attribution URL: http://www.historicengland.org.uk
attribution name: Historic England
publisher: www.historicengland.org.uk
scope note: Soft, porous objects used in bathing and for cleaning. Originally made from the dried skeletons of marine sponges but now more commonly manufactured from synthetic foam.

Bottles
type: Concept
broader: Containers
in scheme: FISH Maritime Cargo Types Thesaurus
issued: 2021-11-19T14:33:00
license: http://creativecommons.org/licenses/by/3.0
attribution URL: http://www.historicengland.org.uk
attribution name: Historic England
publisher: www.historicengland.org.uk
scope note: Narrow necked containers, originally of leather but now usually made of glass or plastic. Used for storing liquids.

Containers
type: Concept
narrower: Bottles
narrower: Barrels
narrower: Amphorae
narrower: Intermodal Containers
narrower: Gunnies
narrower: Crates
broader: Cargo
in scheme: FISH Maritime Cargo Types Thesaurus
issued: 2021-11-19T14:33:00
license: http://creativecommons.org/licenses/by/3.0
attribution URL: http://www.historicengland.org.uk
attribution name: Historic England
publisher: www.historicengland.org.uk
scope note: Receptacles, including boxes, barrels etc., designed to contain something.

Amphorae
type: Concept
broader: Containers
in scheme: FISH Maritime Cargo Types Thesaurus
issued: 2021-11-19T14:33:00
license: http://creativecommons.org/licenses/by/3.0
attribution URL: http://www.historicengland.org.uk
attribution name: Historic England
publisher: www.historicengland.org.uk
scope note: Double-handled storage jars characterised by a long neck and long body used as food and wine containers and for carrying such goods as cargo, found on shipwrecks from Classical antiquity (Greek/Roman).

Gunnies
type: Concept
broader: Containers
in scheme: FISH Maritime Cargo Types Thesaurus
issued: 2021-11-19T14:33:00
license: http://creativecommons.org/licenses/by/3.0
attribution URL: http://www.historicengland.org.uk
attribution name: Historic England
publisher: www.historicengland.org.uk
scope note: Coarse jute sacking

Crates
type: Concept
broader: Containers
in scheme: FISH Maritime Cargo Types Thesaurus
issued: 2021-11-19T14:33:00
license: http://creativecommons.org/licenses/by/3.0
attribution URL: http://www.historicengland.org.uk
attribution name: Historic England
publisher: www.historicengland.org.uk
scope note: Wooden boxes or cases for carrying fruit and other similar goods.

Steel Plate
type: Concept
broader: Steel
in scheme: FISH Maritime Cargo Types Thesaurus
issued: 2021-11-19T14:33:00
license: http://creativecommons.org/licenses/by/3.0
attribution URL: http://www.historicengland.org.uk
attribution name: Historic England
publisher: www.historicengland.org.uk
scope note: Steel which has been formed into sheets.

Steel
type: Concept
narrower: Steel Plate
narrower: Steel Ingots
narrower: Steel Bars
broader: Metal
in scheme: FISH Maritime Cargo Types Thesaurus
issued: 2021-11-19T14:33:00
license: http://creativecommons.org/licenses/by/3.0
attribution URL: http://www.historicengland.org.uk
attribution name: Historic England
publisher: www.historicengland.org.uk
related: Iron
scope note: Alloys of iron which have great strength, malleability and which are able to be tempered to different degrees of hardness. Used for the manufacturwe of tools, machinery etc.

Steel Ingots
type: Concept
broader: Steel
in scheme: FISH Maritime Cargo Types Thesaurus
issued: 2021-11-19T14:33:00
license: http://creativecommons.org/licenses/by/3.0
attribution URL: http://www.historicengland.org.uk
attribution name: Historic England
publisher: www.historicengland.org.uk
scope note: Solid bars made from steel.

Steel Bars
type: Concept
broader: Steel
in scheme: FISH Maritime Cargo Types Thesaurus
issued: 2021-11-19T14:33:00
license: http://creativecommons.org/licenses/by/3.0
attribution URL: http://www.historicengland.org.uk
attribution name: Historic England
publisher: www.historicengland.org.uk
scope note: Steel, usually unworked, in the form of bars.

Corn
type: Concept
broader: Cereal
in scheme: FISH Maritime Cargo Types Thesaurus
issued: 2021-11-19T14:33:00
license: http://creativecommons.org/licenses/by/3.0
attribution URL: http://www.historicengland.org.uk
attribution name: Historic England
publisher: www.historicengland.org.uk
scope note: The seed of a cereal plant used in the manufacture of foodstuffs.

Cereal
type: Concept
narrower: Corn
narrower: Barley
narrower: Rice
narrower: Oats
narrower: Malt
narrower: Maize
narrower: Flour
narrower: Meal
narrower: Rye
narrower: Oatmeal
narrower: Grain
narrower: Wheat
broader: Food
in scheme: FISH Maritime Cargo Types Thesaurus
issued: 2021-11-19T14:33:00
license: http://creativecommons.org/licenses/by/3.0
attribution URL: http://www.historicengland.org.uk
attribution name: Historic England
publisher: www.historicengland.org.uk
scope note: Any of the plants of the grass family, Graminae, cultivated for their edible seeds, especially corn, wheat etc.

Barley
type: Concept
broader: Cereal
in scheme: FISH Maritime Cargo Types Thesaurus
issued: 2021-11-19T14:33:00
license: http://creativecommons.org/licenses/by/3.0
attribution URL: http://www.historicengland.org.uk
attribution name: Historic England
publisher: www.historicengland.org.uk
scope note: Grain from a cereal of the genus hordeum, often used in the manufacture of alcoholic spirits.

Rice
type: Concept
broader: Cereal
in scheme: FISH Maritime Cargo Types Thesaurus
issued: 2021-11-19T14:33:00
license: http://creativecommons.org/licenses/by/3.0
attribution URL: http://www.historicengland.org.uk
attribution name: Historic England
publisher: www.historicengland.org.uk
scope note: A grain, obtained from the grass Oryza sativa, eaten as a staple in many parts of the world.

Oats
type: Concept
broader: Cereal
in scheme: FISH Maritime Cargo Types Thesaurus
issued: 2021-11-19T14:33:00
license: http://creativecommons.org/licenses/by/3.0
attribution URL: http://www.historicengland.org.uk
attribution name: Historic England
publisher: www.historicengland.org.uk
scope note: Grains of cereal used as food.

Malt
type: Concept
broader: Cereal
in scheme: FISH Maritime Cargo Types Thesaurus
issued: 2021-11-19T14:33:00
license: http://creativecommons.org/licenses/by/3.0
attribution URL: http://www.historicengland.org.uk
attribution name: Historic England
publisher: www.historicengland.org.uk
scope note: Grain, especially barley, prepared for brewing, distilling or vinegar making.

Maize
type: Concept
broader: Cereal
in scheme: FISH Maritime Cargo Types Thesaurus
issued: 2021-11-19T14:33:00
license: http://creativecommons.org/licenses/by/3.0
attribution URL: http://www.historicengland.org.uk
attribution name: Historic England
publisher: www.historicengland.org.uk
scope note: A cereal, yellow in colour, the grains of which are embedded in a core known as the cob.

Flour
type: Concept
broader: Cereal
in scheme: FISH Maritime Cargo Types Thesaurus
issued: 2021-11-19T14:33:00
license: http://creativecommons.org/licenses/by/3.0
attribution URL: http://www.historicengland.org.uk
attribution name: Historic England
publisher: www.historicengland.org.uk
scope note: A soft, powder used in the manufacture of bread and foodstuffs, obtained by grinding wheat or other grain.

Meal
type: Concept
broader: Cereal
in scheme: FISH Maritime Cargo Types Thesaurus
issued: 2021-11-19T14:33:00
license: http://creativecommons.org/licenses/by/3.0
attribution URL: http://www.historicengland.org.uk
attribution name: Historic England
publisher: www.historicengland.org.uk
scope note: A powder made by grinding the edible part of various grains, and used as a foodstuff.

Rye
type: Concept
broader: Cereal
in scheme: FISH Maritime Cargo Types Thesaurus
issued: 2021-11-19T14:33:00
license: http://creativecommons.org/licenses/by/3.0
attribution URL: http://www.historicengland.org.uk
attribution name: Historic England
publisher: www.historicengland.org.uk
scope note: A cereal used to make spirits, beer and coarse bread.

Oatmeal
type: Concept
broader: Cereal
in scheme: FISH Maritime Cargo Types Thesaurus
issued: 2021-11-19T14:33:00
license: http://creativecommons.org/licenses/by/3.0
attribution URL: http://www.historicengland.org.uk
attribution name: Historic England
publisher: www.historicengland.org.uk
scope note: Ground oats used as food, often in the form of porridge.

Grain
type: Concept
broader: Cereal
in scheme: FISH Maritime Cargo Types Thesaurus
issued: 2021-11-19T14:33:00
license: http://creativecommons.org/licenses/by/3.0
attribution URL: http://www.historicengland.org.uk
attribution name: Historic England
publisher: www.historicengland.org.uk
scope note: Collective name for the seeds of various cereal grasses.

Wheat
type: Concept
broader: Cereal
in scheme: FISH Maritime Cargo Types Thesaurus
issued: 2021-11-19T14:33:00
license: http://creativecommons.org/licenses/by/3.0
attribution URL: http://www.historicengland.org.uk
attribution name: Historic England
publisher: www.historicengland.org.uk
scope note: A cereal of the genus Triticum, which can be ground to manufacture flour for bread and pasta.

Fish Oil
type: Concept
broader: Liquids
narrower: Cod Liver Oil
in scheme: FISH Maritime Cargo Types Thesaurus
issued: 2021-11-19T14:33:00
license: http://creativecommons.org/licenses/by/3.0
attribution URL: http://www.historicengland.org.uk
attribution name: Historic England
publisher: www.historicengland.org.uk
scope note: Oil manufactured from fish.

Cod Liver Oil
type: Concept
broader: Fish Oil
in scheme: FISH Maritime Cargo Types Thesaurus
issued: 2021-11-19T14:33:00
license: http://creativecommons.org/licenses/by/3.0
attribution URL: http://www.historicengland.org.uk
attribution name: Historic England
publisher: www.historicengland.org.uk
scope note: Oil obtained from the liver of the cod, providing a rich source of vitamins A and D.

Liquids
type: Concept
narrower: Fish Oil
narrower: Alcoholic Drink
narrower: Coconut Oil
narrower: Palm Oil
narrower: Molasses
narrower: Water
narrower: Vinegar
narrower: Olive Oil
narrower: Honey
broader: Food
in scheme: FISH Maritime Cargo Types Thesaurus
issued: 2021-11-19T14:33:00
license: http://creativecommons.org/licenses/by/3.0
attribution URL: http://www.historicengland.org.uk
attribution name: Historic England
publisher: www.historicengland.org.uk
scope note: A fluid substance. Use for unspecified liquids only, where known use more specific type.

Coconut Oil
type: Concept
broader: Liquids
in scheme: FISH Maritime Cargo Types Thesaurus
issued: 2021-11-19T14:33:00
license: http://creativecommons.org/licenses/by/3.0
attribution URL: http://www.historicengland.org.uk
attribution name: Historic England
publisher: www.historicengland.org.uk
scope note: Oil obtained from the flesh of the coconut and used in ointments, soaps etc.

Palm Oil
type: Concept
broader: Liquids
in scheme: FISH Maritime Cargo Types Thesaurus
issued: 2021-11-19T14:33:00
license: http://creativecommons.org/licenses/by/3.0
attribution URL: http://www.historicengland.org.uk
attribution name: Historic England
publisher: www.historicengland.org.uk
scope note: Oil derived from palms, used for a variety of purposes.

Molasses
type: Concept
broader: Liquids
in scheme: FISH Maritime Cargo Types Thesaurus
issued: 2021-11-19T14:33:00
license: http://creativecommons.org/licenses/by/3.0
attribution URL: http://www.historicengland.org.uk
attribution name: Historic England
publisher: www.historicengland.org.uk
scope note: An uncrystallized syrup, produced as part of the sugar refining process. Used as a food additive and in the production of rum.

Vinegar
type: Concept
broader: Liquids
in scheme: FISH Maritime Cargo Types Thesaurus
issued: 2021-11-19T14:33:00
license: http://creativecommons.org/licenses/by/3.0
attribution URL: http://www.historicengland.org.uk
attribution name: Historic England
publisher: www.historicengland.org.uk
scope note: A sour tasting liquid, produced from wine and other liquors, used as a preservative, in pickling, or as a flavouring for food.

Olive Oil
type: Concept
broader: Liquids
in scheme: FISH Maritime Cargo Types Thesaurus
issued: 2021-11-19T14:33:00
license: http://creativecommons.org/licenses/by/3.0
attribution URL: http://www.historicengland.org.uk
attribution name: Historic England
publisher: www.historicengland.org.uk
scope note: Oil produced from the pulp of olives.

Granite Boulders
type: Concept
broader: Granite
in scheme: FISH Maritime Cargo Types Thesaurus
issued: 2021-11-19T14:33:00
license: http://creativecommons.org/licenses/by/3.0
attribution URL: http://www.historicengland.org.uk
attribution name: Historic England
publisher: www.historicengland.org.uk
scope note: Boulders of unprocessed granite.

Granite
type: Concept
narrower: Granite Boulders
narrower: Granite Chips
narrower: Moorstone
narrower: Granite Blocks
broader: Stone
in scheme: FISH Maritime Cargo Types Thesaurus
issued: 2021-11-19T14:33:00
license: http://creativecommons.org/licenses/by/3.0
attribution URL: http://www.historicengland.org.uk
attribution name: Historic England
publisher: www.historicengland.org.uk
scope note: A granular, crystalline, hard rock often used as a building material.

Granite Chips
type: Concept
broader: Granite
in scheme: FISH Maritime Cargo Types Thesaurus
issued: 2021-11-19T14:33:00
license: http://creativecommons.org/licenses/by/3.0
attribution URL: http://www.historicengland.org.uk
attribution name: Historic England
publisher: www.historicengland.org.uk
scope note: Small fragments of granite.

Moorstone
type: Concept
broader: Granite
in scheme: FISH Maritime Cargo Types Thesaurus
issued: 2021-11-19T14:33:00
license: http://creativecommons.org/licenses/by/3.0
attribution URL: http://www.historicengland.org.uk
attribution name: Historic England
publisher: www.historicengland.org.uk
scope note: A form of granite found in Cornwall

Granite Blocks
type: Concept
broader: Granite
in scheme: FISH Maritime Cargo Types Thesaurus
issued: 2021-11-19T14:33:00
license: http://creativecommons.org/licenses/by/3.0
attribution URL: http://www.historicengland.org.uk
attribution name: Historic England
publisher: www.historicengland.org.uk
scope note: Blocks carved out of granite and used as a building material.

Indigo
type: Concept
broader: Plant Products
in scheme: FISH Maritime Cargo Types Thesaurus
issued: 2021-11-19T14:33:00
license: http://creativecommons.org/licenses/by/3.0
attribution URL: http://www.historicengland.org.uk
attribution name: Historic England
publisher: www.historicengland.org.uk
scope note: A dark blue powder, obtained from plants or synthetically manufactured, used as a dye.

Plant Products
type: Concept
narrower: Indigo
narrower: Ivory Nuts
narrower: Hemp
narrower: Jute
narrower: Palm Kernels
narrower: Coconut Fibre Matting
narrower: Rape Seed
narrower: Flax
narrower: Woad
narrower: Cotton
narrower: Linseed
narrower: Seed
narrower: Straw
narrower: Hay
narrower: Turpentine
narrower: Liquorice
narrower: Tobacco
narrower: Copra
narrower: Gum
narrower: Honey
narrower: Esparto Grass
narrower: Rubber
broader: Plants And Plant Products
in scheme: FISH Maritime Cargo Types Thesaurus
issued: 2021-11-19T14:33:00
license: http://creativecommons.org/licenses/by/3.0
attribution URL: http://www.historicengland.org.uk
attribution name: Historic England
publisher: www.historicengland.org.uk
scope note: Products manufactured from plant materials.

Ivory Nuts
type: Concept
broader: Plant Products
in scheme: FISH Maritime Cargo Types Thesaurus
issued: 2021-11-19T14:33:00
license: http://creativecommons.org/licenses/by/3.0
attribution URL: http://www.historicengland.org.uk
attribution name: Historic England
publisher: www.historicengland.org.uk
scope note: The seeds of the palm Phytelephas macrocarpa, the albumen of which, hardens resembling ivory in colour, texture and toughness and is used to make ornamental buttons etc.

Jute
type: Concept
broader: Plant Products
in scheme: FISH Maritime Cargo Types Thesaurus
issued: 2021-11-19T14:33:00
license: http://creativecommons.org/licenses/by/3.0
attribution URL: http://www.historicengland.org.uk
attribution name: Historic England
publisher: www.historicengland.org.uk
scope note: Fibres obtained from plants and used in the manufacture of ropes, sacking, canvas etc.

Coconut Fibre Matting
type: Concept
broader: Plant Products
in scheme: FISH Maritime Cargo Types Thesaurus
issued: 2021-11-19T14:33:00
license: http://creativecommons.org/licenses/by/3.0
attribution URL: http://www.historicengland.org.uk
attribution name: Historic England
publisher: www.historicengland.org.uk
scope note: Matting manufactured using the fibres from the outer husks of coconuts.

Rape Seed
type: Concept
broader: Plant Products
in scheme: FISH Maritime Cargo Types Thesaurus
issued: 2021-11-19T14:33:00
license: http://creativecommons.org/licenses/by/3.0
attribution URL: http://www.historicengland.org.uk
attribution name: Historic England
publisher: www.historicengland.org.uk
scope note: The oil rich seed of the plant Bracchus napus.

Straw
type: Concept
broader: Plant Products
in scheme: FISH Maritime Cargo Types Thesaurus
issued: 2021-11-19T14:33:00
license: http://creativecommons.org/licenses/by/3.0
attribution URL: http://www.historicengland.org.uk
attribution name: Historic England
publisher: www.historicengland.org.uk
scope note: The stalks of cereals separated from the grain br threshing and used as fodder, basket manufacture, thatch etc.

Hay
type: Concept
broader: Plant Products
in scheme: FISH Maritime Cargo Types Thesaurus
issued: 2021-11-19T14:33:00
license: http://creativecommons.org/licenses/by/3.0
attribution URL: http://www.historicengland.org.uk
attribution name: Historic England
publisher: www.historicengland.org.uk
scope note: Dried grass used as fodder.

Turpentine
type: Concept
broader: Plant Products
in scheme: FISH Maritime Cargo Types Thesaurus
issued: 2021-11-19T14:33:00
license: http://creativecommons.org/licenses/by/3.0
attribution URL: http://www.historicengland.org.uk
attribution name: Historic England
publisher: www.historicengland.org.uk
scope note: An oil obtained by the distillation of wood and used as a solvent and paint thinner and in some medical preparations.

Tobacco
type: Concept
broader: Plant Products
in scheme: FISH Maritime Cargo Types Thesaurus
issued: 2021-11-19T14:33:00
license: http://creativecommons.org/licenses/by/3.0
attribution URL: http://www.historicengland.org.uk
attribution name: Historic England
publisher: www.historicengland.org.uk
scope note: The dried leaves of the plants, Nicotiana tabacum or Nicotiana rustica, which are smoked (in pipes, cigars or cigarettes), chewed or taken as snuff for their relaxing properties.

Copra
type: Concept
broader: Plant Products
in scheme: FISH Maritime Cargo Types Thesaurus
issued: 2021-11-19T14:33:00
license: http://creativecommons.org/licenses/by/3.0
attribution URL: http://www.historicengland.org.uk
attribution name: Historic England
publisher: www.historicengland.org.uk
scope note: Dried kernel of coconut

Gum
type: Concept
broader: Plant Products
in scheme: FISH Maritime Cargo Types Thesaurus
issued: 2021-11-19T14:33:00
license: http://creativecommons.org/licenses/by/3.0
attribution URL: http://www.historicengland.org.uk
attribution name: Historic England
publisher: www.historicengland.org.uk
scope note: A substance secreted by some plants which hardens upon drying but is soluble in water.

Esparto Grass
type: Concept
broader: Plant Products
in scheme: FISH Maritime Cargo Types Thesaurus
issued: 2021-11-19T14:33:00
license: http://creativecommons.org/licenses/by/3.0
attribution URL: http://www.historicengland.org.uk
attribution name: Historic England
publisher: www.historicengland.org.uk
scope note: A grass, used in paper making, native to Spain and North Africa.

Rubber
type: Concept
broader: Plant Products
in scheme: FISH Maritime Cargo Types Thesaurus
issued: 2021-11-19T14:33:00
license: http://creativecommons.org/licenses/by/3.0
attribution URL: http://www.historicengland.org.uk
attribution name: Historic England
publisher: www.historicengland.org.uk
scope note: The latex of plants tacky in its normal state and elastic after treatment. Used for a variety of purposes.

Oysters
type: Concept
broader: Shellfish
in scheme: FISH Maritime Cargo Types Thesaurus
issued: 2021-11-19T14:33:00
license: http://creativecommons.org/licenses/by/3.0
attribution URL: http://www.historicengland.org.uk
attribution name: Historic England
publisher: www.historicengland.org.uk
scope note: A mollusc usually used as a foodstuff.

Shellfish
type: Concept
narrower: Oysters
narrower: Prawns
broader: Fish
in scheme: FISH Maritime Cargo Types Thesaurus
issued: 2021-11-19T14:33:00
license: http://creativecommons.org/licenses/by/3.0
attribution URL: http://www.historicengland.org.uk
attribution name: Historic England
publisher: www.historicengland.org.uk
scope note: Aquatic invertebrate animals whose outer covering is a shell, often 'farmed' to be eaten. Includes molluscs and crustaceans.

Prawns
type: Concept
broader: Shellfish
in scheme: FISH Maritime Cargo Types Thesaurus
issued: 2021-11-19T14:33:00
license: http://creativecommons.org/licenses/by/3.0
attribution URL: http://www.historicengland.org.uk
attribution name: Historic England
publisher: www.historicengland.org.uk
scope note: Small, marine crustaceans are used as food.

Porter
type: Concept
broader: Beer
in scheme: FISH Maritime Cargo Types Thesaurus
issued: 2021-11-19T14:33:00
license: http://creativecommons.org/licenses/by/3.0
attribution URL: http://www.historicengland.org.uk
attribution name: Historic England
publisher: www.historicengland.org.uk
scope note: A bitter beer brewed using charred or browned malt.

Beer
type: Concept
narrower: Porter
broader: Alcoholic Drink
in scheme: FISH Maritime Cargo Types Thesaurus
issued: 2021-11-19T14:33:00
license: http://creativecommons.org/licenses/by/3.0
attribution URL: http://www.historicengland.org.uk
attribution name: Historic England
publisher: www.historicengland.org.uk
scope note: An alcoholic drink made by the fermentation of malt and flavoured with hops or other bitters.

Spelter
type: Concept
broader: Zinc
in scheme: FISH Maritime Cargo Types Thesaurus
issued: 2021-11-19T14:33:00
license: http://creativecommons.org/licenses/by/3.0
attribution URL: http://www.historicengland.org.uk
attribution name: Historic England
publisher: www.historicengland.org.uk
scope note: Zinc, now mainly used for smelted zinc but has been used to include zinc ores.

Zinc
type: Concept
narrower: Spelter
narrower: Zinc Ingots
broader: Metal
in scheme: FISH Maritime Cargo Types Thesaurus
issued: 2021-11-19T14:33:00
license: http://creativecommons.org/licenses/by/3.0
attribution URL: http://www.historicengland.org.uk
attribution name: Historic England
publisher: www.historicengland.org.uk
scope note: A hard, lustrous metallic element obtained from various ores, including sphalerite, and used in roofing, alloys and for galvanizing iron.

Zinc Ingots
type: Concept
broader: Zinc
in scheme: FISH Maritime Cargo Types Thesaurus
issued: 2021-11-19T14:33:00
license: http://creativecommons.org/licenses/by/3.0
attribution URL: http://www.historicengland.org.uk
attribution name: Historic England
publisher: www.historicengland.org.uk
scope note: Solid bars made from pure zinc.

Glycerine
type: Concept
broader: Oil Based Products
in scheme: FISH Maritime Cargo Types Thesaurus
issued: 2021-11-19T14:33:00
license: http://creativecommons.org/licenses/by/3.0
attribution URL: http://www.historicengland.org.uk
attribution name: Historic England
publisher: www.historicengland.org.uk
scope note: A colourless, thick sweet liquid used in the manufacture of chemicals.

Oil Based Products
type: Concept
narrower: Glycerine
narrower: Petroleum
narrower: Resin
narrower: Benzine
narrower: Naphtha
narrower: Tar
narrower: Pitch
narrower: White Spirit
narrower: Paraffin
narrower: Oil
broader: Cargo
in scheme: FISH Maritime Cargo Types Thesaurus
issued: 2021-11-19T14:33:00
license: http://creativecommons.org/licenses/by/3.0
attribution URL: http://www.historicengland.org.uk
attribution name: Historic England
publisher: www.historicengland.org.uk
scope note: Materials or goods which have been produced wholly or in part from oil, e.g. petroleum.

Benzine
type: Concept
broader: Oil Based Products
in scheme: FISH Maritime Cargo Types Thesaurus
issued: 2021-11-19T14:33:00
license: http://creativecommons.org/licenses/by/3.0
attribution URL: http://www.historicengland.org.uk
attribution name: Historic England
publisher: www.historicengland.org.uk
scope note: A mixture of paraffins distilled from petroleum and used as a fuel and solvent.

Naphtha
type: Concept
broader: Oil Based Products
in scheme: FISH Maritime Cargo Types Thesaurus
issued: 2021-11-19T14:33:00
license: http://creativecommons.org/licenses/by/3.0
attribution URL: http://www.historicengland.org.uk
attribution name: Historic England
publisher: www.historicengland.org.uk
scope note: A flammable liquid that occurs naturally and is also now distilled.

Tar
type: Concept
broader: Oil Based Products
in scheme: FISH Maritime Cargo Types Thesaurus
issued: 2021-11-19T14:33:00
license: http://creativecommons.org/licenses/by/3.0
attribution URL: http://www.historicengland.org.uk
attribution name: Historic England
publisher: www.historicengland.org.uk
scope note: A thick, viscous, black liquid obtained by the destructive distillation of coal or other organic substances used for preserving wood or rope and for covering road surfaces.

Pitch
type: Concept
broader: Oil Based Products
in scheme: FISH Maritime Cargo Types Thesaurus
issued: 2021-11-19T14:33:00
license: http://creativecommons.org/licenses/by/3.0
attribution URL: http://www.historicengland.org.uk
attribution name: Historic England
publisher: www.historicengland.org.uk
scope note: A dark, viscous substance obtained, from the distillation of wood tar or turpentine, and used as a sealant for caulking the seams of a ship or boat.

White Spirit
type: Concept
broader: Oil Based Products
in scheme: FISH Maritime Cargo Types Thesaurus
issued: 2021-11-19T14:33:00
license: http://creativecommons.org/licenses/by/3.0
attribution URL: http://www.historicengland.org.uk
attribution name: Historic England
publisher: www.historicengland.org.uk
scope note: A volatile, colourless distillate of petroleum used as a solvent and paint thinner.

Cast Iron Pipes
type: Concept
broader: Iron Pipes
in scheme: FISH Maritime Cargo Types Thesaurus
issued: 2021-11-19T14:33:00
license: http://creativecommons.org/licenses/by/3.0
attribution URL: http://www.historicengland.org.uk
attribution name: Historic England
publisher: www.historicengland.org.uk
scope note: Pipes manufactured from cast iron and used for a variety of purposes.

Iron Pipes
type: Concept
narrower: Cast Iron Pipes
broader: Pipes
in scheme: FISH Maritime Cargo Types Thesaurus
issued: 2021-11-19T14:33:00
license: http://creativecommons.org/licenses/by/3.0
attribution URL: http://www.historicengland.org.uk
attribution name: Historic England
publisher: www.historicengland.org.uk
scope note: Pipes manufactured from iron and used for a variety of purposes.

Whisky
type: Concept
broader: Spirits
in scheme: FISH Maritime Cargo Types Thesaurus
issued: 2021-11-19T14:33:00
license: http://creativecommons.org/licenses/by/3.0
attribution URL: http://www.historicengland.org.uk
attribution name: Historic England
publisher: www.historicengland.org.uk
scope note: An alcoholic spirit distilled from malted barley or barley and maize or rye.

Spirits
type: Concept
narrower: Whisky
narrower: Rum
narrower: Gin
narrower: Brandy
broader: Alcoholic Drink
in scheme: FISH Maritime Cargo Types Thesaurus
issued: 2021-11-19T14:33:00
license: http://creativecommons.org/licenses/by/3.0
attribution URL: http://www.historicengland.org.uk
attribution name: Historic England
publisher: www.historicengland.org.uk
scope note: Usually distilled alcohollic drink but also used for liquids where a substance is in solution with alcohol.

Rum
type: Concept
broader: Spirits
in scheme: FISH Maritime Cargo Types Thesaurus
issued: 2021-11-19T14:33:00
license: http://creativecommons.org/licenses/by/3.0
attribution URL: http://www.historicengland.org.uk
attribution name: Historic England
publisher: www.historicengland.org.uk
scope note: An alcoholic spirit distilled from sugar products, especially molasses.

Gin
type: Concept
broader: Spirits
in scheme: FISH Maritime Cargo Types Thesaurus
issued: 2021-11-19T14:33:00
license: http://creativecommons.org/licenses/by/3.0
attribution URL: http://www.historicengland.org.uk
attribution name: Historic England
publisher: www.historicengland.org.uk
scope note: An alcoholic beverage distilled from grain or malt and usually flavoured with juniper berries.

Brandy
type: Concept
broader: Spirits
in scheme: FISH Maritime Cargo Types Thesaurus
issued: 2021-11-19T14:33:00
license: http://creativecommons.org/licenses/by/3.0
attribution URL: http://www.historicengland.org.uk
attribution name: Historic England
publisher: www.historicengland.org.uk
scope note: Alcoholic drink distilled from wine or fermented fruit juice.

Salted Mackerel
type: Concept
broader: Salted Fish
in scheme: FISH Maritime Cargo Types Thesaurus
issued: 2021-11-19T14:33:00
license: http://creativecommons.org/licenses/by/3.0
attribution URL: http://www.historicengland.org.uk
attribution name: Historic England
publisher: www.historicengland.org.uk
scope note: Mackerel which has been salted to preserve it.

Salted Fish
type: Concept
narrower: Salted Mackerel
broader: Fish
in scheme: FISH Maritime Cargo Types Thesaurus
issued: 2021-11-19T14:33:00
license: http://creativecommons.org/licenses/by/3.0
attribution URL: http://www.historicengland.org.uk
attribution name: Historic England
publisher: www.historicengland.org.uk
scope note: Fish of any kind preserved by salting, for example salted cod such as bacalhau or bacalao.

Felt
type: Concept
broader: Textiles
in scheme: FISH Maritime Cargo Types Thesaurus
issued: 2021-11-19T14:33:00
license: http://creativecommons.org/licenses/by/3.0
attribution URL: http://www.historicengland.org.uk
attribution name: Historic England
publisher: www.historicengland.org.uk
scope note: Fabric manufactured from fibrous materials, consolidated by heat and compression so that the fibres become matted together.

Textiles
type: Concept
narrower: Felt
narrower: Linen
narrower: Calico
narrower: Silk
narrower: Blankets
narrower: Carpet
narrower: Sailcloth
narrower: Wool
narrower: Cloth
narrower: Canvas
narrower: Flags
narrower: Cotton
broader: Textiles And Clothing
in scheme: FISH Maritime Cargo Types Thesaurus
issued: 2021-11-19T14:33:00
license: http://creativecommons.org/licenses/by/3.0
attribution URL: http://www.historicengland.org.uk
attribution name: Historic England
publisher: www.historicengland.org.uk
scope note: Threads of material used to form cloth.

Calico
type: Concept
broader: Textiles
in scheme: FISH Maritime Cargo Types Thesaurus
issued: 2021-11-19T14:33:00
license: http://creativecommons.org/licenses/by/3.0
attribution URL: http://www.historicengland.org.uk
attribution name: Historic England
publisher: www.historicengland.org.uk
scope note: Plain, white, cotton cloth often unbleached.

Silk
type: Concept
broader: Textiles
in scheme: FISH Maritime Cargo Types Thesaurus
issued: 2021-11-19T14:33:00
license: http://creativecommons.org/licenses/by/3.0
attribution URL: http://www.historicengland.org.uk
attribution name: Historic England
publisher: www.historicengland.org.uk
scope note: A fine, soft fibre produced by silkworms and used to make thread for textiles. Also the cloth made from this thread.

Blankets
type: Concept
broader: Textiles
in scheme: FISH Maritime Cargo Types Thesaurus
issued: 2021-11-19T14:33:00
license: http://creativecommons.org/licenses/by/3.0
attribution URL: http://www.historicengland.org.uk
attribution name: Historic England
publisher: www.historicengland.org.uk
scope note: Bed coverings, usually of woollen or similar natural or artificial fabrics.

Carpet
type: Concept
broader: Textiles
in scheme: FISH Maritime Cargo Types Thesaurus
issued: 2021-11-19T14:33:00
license: http://creativecommons.org/licenses/by/3.0
attribution URL: http://www.historicengland.org.uk
attribution name: Historic England
publisher: www.historicengland.org.uk
scope note: Wool, textile, or synthetic floor covering material.

Sailcloth
type: Concept
broader: Textiles
in scheme: FISH Maritime Cargo Types Thesaurus
issued: 2021-11-19T14:33:00
license: http://creativecommons.org/licenses/by/3.0
attribution URL: http://www.historicengland.org.uk
attribution name: Historic England
publisher: www.historicengland.org.uk
scope note: Canvas or similar fabric used for the manufacture of sails.

Canvas
type: Concept
broader: Textiles
in scheme: FISH Maritime Cargo Types Thesaurus
issued: 2021-11-19T14:33:00
license: http://creativecommons.org/licenses/by/3.0
attribution URL: http://www.historicengland.org.uk
attribution name: Historic England
publisher: www.historicengland.org.uk
scope note: A strong unbleached cloth manuifactured from hemp, flax or similarly coarse yarn. Used mainly in the manufacture of sails, tents and for painting on.

Flags
type: Concept
broader: Textiles
in scheme: FISH Maritime Cargo Types Thesaurus
issued: 2021-11-19T14:33:00
license: http://creativecommons.org/licenses/by/3.0
attribution URL: http://www.historicengland.org.uk
attribution name: Historic England
publisher: www.historicengland.org.uk
scope note: Pieces of material, usually decorated, used as standards, for signalling or for decoration. Often used as a symbol of a particular nation eg. the Union Flag of Great Britain.

Fire Bricks
type: Concept
broader: Construction Materials
in scheme: FISH Maritime Cargo Types Thesaurus
issued: 2021-11-19T14:33:00
license: http://creativecommons.org/licenses/by/3.0
attribution URL: http://www.historicengland.org.uk
attribution name: Historic England
publisher: www.historicengland.org.uk
scope note: Bricks capable of withstanding heat without burning. Used to line fireplaces, kilns etc.

Construction Materials
type: Concept
narrower: Fire Bricks
narrower: Board
narrower: Girders
narrower: Roofing Shingles
narrower: Tiles
narrower: Corrugated Iron
narrower: Deals
narrower: Staves
narrower: Loam
narrower: Steel Rails
narrower: Asphalt
narrower: Bricks
narrower: Battens
narrower: Laths
narrower: Pipes
narrower: Nails
narrower: Concrete
narrower: Creosote
narrower: Iron Rails
narrower: Poles
narrower: Planks
narrower: Spars
narrower: Glass
broader: Cargo
in scheme: FISH Maritime Cargo Types Thesaurus
issued: 2021-11-19T14:33:00
license: http://creativecommons.org/licenses/by/3.0
attribution URL: http://www.historicengland.org.uk
attribution name: Historic England
publisher: www.historicengland.org.uk
scope note: Materials used for the construction of buildings, vehicles or other objects.

Board
type: Concept
broader: Construction Materials
in scheme: FISH Maritime Cargo Types Thesaurus
issued: 2021-11-19T14:33:00
license: http://creativecommons.org/licenses/by/3.0
attribution URL: http://www.historicengland.org.uk
attribution name: Historic England
publisher: www.historicengland.org.uk
scope note: Flat, rectangular piece of material, traditionally of wood but now of any material, used in the construction industries.

Girders
type: Concept
broader: Construction Materials
in scheme: FISH Maritime Cargo Types Thesaurus
issued: 2021-11-19T14:33:00
license: http://creativecommons.org/licenses/by/3.0
attribution URL: http://www.historicengland.org.uk
attribution name: Historic England
publisher: www.historicengland.org.uk
scope note: Beams of wood, iron, steel etc., used in the construction industry.

Roofing Shingles
type: Concept
broader: Construction Materials
in scheme: FISH Maritime Cargo Types Thesaurus
issued: 2021-11-19T14:33:00
license: http://creativecommons.org/licenses/by/3.0
attribution URL: http://www.historicengland.org.uk
attribution name: Historic England
publisher: www.historicengland.org.uk
scope note: Thin, rectangular tiles, usually made of wood, used for roofing.

Tiles
type: Concept
broader: Construction Materials
in scheme: FISH Maritime Cargo Types Thesaurus
issued: 2021-11-19T14:33:00
license: http://creativecommons.org/licenses/by/3.0
attribution URL: http://www.historicengland.org.uk
attribution name: Historic England
publisher: www.historicengland.org.uk
scope note: Shaped material used for covering buildings, usually as a roofing material though can be used on walls or floors. Often of fired clay they can be of other materials particularly stone.

Corrugated Iron
type: Concept
broader: Construction Materials
in scheme: FISH Maritime Cargo Types Thesaurus
issued: 2021-11-19T14:33:00
license: http://creativecommons.org/licenses/by/3.0
attribution URL: http://www.historicengland.org.uk
attribution name: Historic England
publisher: www.historicengland.org.uk
scope note: Sheets of iron or steel bent into a series of ridges and hollows to give added strength and rigidity.

Staves
type: Concept
broader: Construction Materials
in scheme: FISH Maritime Cargo Types Thesaurus
issued: 2021-11-19T14:33:00
license: http://creativecommons.org/licenses/by/3.0
attribution URL: http://www.historicengland.org.uk
attribution name: Historic England
publisher: www.historicengland.org.uk
scope note: Pieces of timber shaped for use in the construction of buildings, barrels etc.

Loam
type: Concept
broader: Construction Materials
in scheme: FISH Maritime Cargo Types Thesaurus
issued: 2021-11-19T14:33:00
license: http://creativecommons.org/licenses/by/3.0
attribution URL: http://www.historicengland.org.uk
attribution name: Historic England
publisher: www.historicengland.org.uk
scope note: Fertile soil composed mainly of humus, sand and clay.

Steel Rails
type: Concept
broader: Construction Materials
in scheme: FISH Maritime Cargo Types Thesaurus
issued: 2021-11-19T14:33:00
license: http://creativecommons.org/licenses/by/3.0
attribution URL: http://www.historicengland.org.uk
attribution name: Historic England
publisher: www.historicengland.org.uk
scope note: Steel in the form of rails eg. for use in the construction of railways.

Asphalt
type: Concept
broader: Construction Materials
in scheme: FISH Maritime Cargo Types Thesaurus
issued: 2021-11-19T14:33:00
license: http://creativecommons.org/licenses/by/3.0
attribution URL: http://www.historicengland.org.uk
attribution name: Historic England
publisher: www.historicengland.org.uk
scope note: A viscous, bituminous pitch which can be used for surfacing roads.

Bricks
type: Concept
broader: Construction Materials
in scheme: FISH Maritime Cargo Types Thesaurus
issued: 2021-11-19T14:33:00
license: http://creativecommons.org/licenses/by/3.0
attribution URL: http://www.historicengland.org.uk
attribution name: Historic England
publisher: www.historicengland.org.uk
scope note: Construction blocks manufactured using clay which is then fired or sun dried.

Battens
type: Concept
broader: Construction Materials
in scheme: FISH Maritime Cargo Types Thesaurus
issued: 2021-11-19T14:33:00
license: http://creativecommons.org/licenses/by/3.0
attribution URL: http://www.historicengland.org.uk
attribution name: Historic England
publisher: www.historicengland.org.uk
scope note: Long narrow pieces of wood used for a variety of purposes.

Laths
type: Concept
broader: Construction Materials
in scheme: FISH Maritime Cargo Types Thesaurus
issued: 2021-11-19T14:33:00
license: http://creativecommons.org/licenses/by/3.0
attribution URL: http://www.historicengland.org.uk
attribution name: Historic England
publisher: www.historicengland.org.uk
scope note: Narrow strips of wood used in the building industry.

Nails
type: Concept
broader: Construction Materials
in scheme: FISH Maritime Cargo Types Thesaurus
issued: 2021-11-19T14:33:00
license: http://creativecommons.org/licenses/by/3.0
attribution URL: http://www.historicengland.org.uk
attribution name: Historic England
publisher: www.historicengland.org.uk
scope note: Metal spikes used for fixing one object to another.

Concrete
type: Concept
broader: Construction Materials
in scheme: FISH Maritime Cargo Types Thesaurus
issued: 2021-11-19T14:33:00
license: http://creativecommons.org/licenses/by/3.0
attribution URL: http://www.historicengland.org.uk
attribution name: Historic England
publisher: www.historicengland.org.uk
scope note: Building material made by combining gravel, cement, water and sand. When hard it forms a stonelike surface, used for paving and building.

Creosote
type: Concept
broader: Construction Materials
in scheme: FISH Maritime Cargo Types Thesaurus
issued: 2021-11-19T14:33:00
license: http://creativecommons.org/licenses/by/3.0
attribution URL: http://www.historicengland.org.uk
attribution name: Historic England
publisher: www.historicengland.org.uk
scope note: A liquid derived from wood tar through a distillation process. Now used to describe timber preservative derived from coal tar.

Iron Rails
type: Concept
broader: Construction Materials
in scheme: FISH Maritime Cargo Types Thesaurus
issued: 2021-11-19T14:33:00
license: http://creativecommons.org/licenses/by/3.0
attribution URL: http://www.historicengland.org.uk
attribution name: Historic England
publisher: www.historicengland.org.uk
scope note: Iron in the form of rails eg. for use in the construction of railways.

Poles
type: Concept
broader: Construction Materials
in scheme: FISH Maritime Cargo Types Thesaurus
issued: 2021-11-19T14:33:00
license: http://creativecommons.org/licenses/by/3.0
attribution URL: http://www.historicengland.org.uk
attribution name: Historic England
publisher: www.historicengland.org.uk
scope note: A long thin piece of wood,

Planks
type: Concept
broader: Construction Materials
in scheme: FISH Maritime Cargo Types Thesaurus
issued: 2021-11-19T14:33:00
license: http://creativecommons.org/licenses/by/3.0
attribution URL: http://www.historicengland.org.uk
attribution name: Historic England
publisher: www.historicengland.org.uk
scope note: Timber sawn into long, flat, pieces used for flooring etc. in buildings.

Glass
type: Concept
broader: Construction Materials
in scheme: FISH Maritime Cargo Types Thesaurus
issued: 2021-11-19T14:33:00
license: http://creativecommons.org/licenses/by/3.0
attribution URL: http://www.historicengland.org.uk
attribution name: Historic England
publisher: www.historicengland.org.uk
scope note: Hard, transparent, brittle substance manufactured by fusing soda or potash with other ingredients. Used for glazing windows and in the manufacture of drinking vessels.

Kainite
type: Concept
broader: Fertilizer
in scheme: FISH Maritime Cargo Types Thesaurus
issued: 2021-11-19T14:33:00
license: http://creativecommons.org/licenses/by/3.0
attribution URL: http://www.historicengland.org.uk
attribution name: Historic England
publisher: www.historicengland.org.uk
scope note: A mineral salt consisting of potassium chloride and mangensium sulphate, used as a fertilizer.

Fertilizer
type: Concept
narrower: Kainite
narrower: Nitrate
narrower: Coprolites
narrower: Superphosphate
narrower: Manure
broader: Fertilizer And Waste
in scheme: FISH Maritime Cargo Types Thesaurus
issued: 2021-11-19T14:33:00
license: http://creativecommons.org/licenses/by/3.0
attribution URL: http://www.historicengland.org.uk
attribution name: Historic England
publisher: www.historicengland.org.uk
scope note: Substances, either natural or man-made, used to make soil more fertile.

Coprolites
type: Concept
broader: Fertilizer
in scheme: FISH Maritime Cargo Types Thesaurus
issued: 2021-11-19T14:33:00
license: http://creativecommons.org/licenses/by/3.0
attribution URL: http://www.historicengland.org.uk
attribution name: Historic England
publisher: www.historicengland.org.uk
scope note: Fossilized animal dung, often ground into powder and used as fertilizer.

Superphosphate
type: Concept
broader: Fertilizer
in scheme: FISH Maritime Cargo Types Thesaurus
issued: 2021-11-19T14:33:00
license: http://creativecommons.org/licenses/by/3.0
attribution URL: http://www.historicengland.org.uk
attribution name: Historic England
publisher: www.historicengland.org.uk
scope note: A chemical fertilizer made by treating powdered phosphate rock with sulphuric acid.

Manure
type: Concept
broader: Fertilizer
in scheme: FISH Maritime Cargo Types Thesaurus
issued: 2021-11-19T14:33:00
license: http://creativecommons.org/licenses/by/3.0
attribution URL: http://www.historicengland.org.uk
attribution name: Historic England
publisher: www.historicengland.org.uk
scope note: Dung or compost, carried either as an export cargo or as waste to be dumped out at sea.

Deals
type: Concept
broader: Timber Products
broader: Construction Materials
in scheme: FISH Maritime Cargo Types Thesaurus
issued: 2021-11-19T14:33:00
license: http://creativecommons.org/licenses/by/3.0
attribution URL: http://www.historicengland.org.uk
attribution name: Historic England
publisher: www.historicengland.org.uk
scope note: Planks or boards manufactured from softwood timber.

Plants And Plant Products
type: Concept
narrower: Timber
narrower: Plant Products
narrower: Plants
broader: Cargo
in scheme: FISH Maritime Cargo Types Thesaurus
issued: 2021-11-19T14:33:00
license: http://creativecommons.org/licenses/by/3.0
attribution URL: http://www.historicengland.org.uk
attribution name: Historic England
publisher: www.historicengland.org.uk
scope note: Includes all trees, flowers, vegetables etc. and any products manufactured from them.

Provisions
type: Concept
broader: Cargo
in scheme: FISH Maritime Cargo Types Thesaurus
issued: 2021-11-19T14:33:00
license: http://creativecommons.org/licenses/by/3.0
attribution URL: http://www.historicengland.org.uk
attribution name: Historic England
publisher: www.historicengland.org.uk
scope note: Supplies including food, drink and equipment necessary for a journey.

Cargo
type: Concept
narrower: Provisions
narrower: Military Equipment
narrower: Mats
narrower: Containers
narrower: Fuel
narrower: Plants And Plant Products
narrower: Railway Components
narrower: Animals And Animal Products
narrower: Chemicals
narrower: Manufactured Goods
narrower: Government Stores
narrower: Jewels
narrower: Cordage
narrower: General Cargo
narrower: Mail
narrower: Minerals
narrower: Paper And Paper Products
narrower: Fertilizer And Waste
narrower: Textiles And Clothing
narrower: Oil Based Products
narrower: People
narrower: Construction Materials
narrower: Ship Fittings
narrower: Pigment
narrower: Food
narrower: Animal Fodder
narrower: Ballast
narrower: Metal
narrower: Statues
in scheme: FISH Maritime Cargo Types Thesaurus
issued: 2021-11-19T14:33:00
license: http://creativecommons.org/licenses/by/3.0
attribution URL: http://www.historicengland.org.uk
attribution name: Historic England
publisher: www.historicengland.org.uk
scope note: This is the top term for the thesaurus.
top concept of: FISH Maritime Cargo Types Thesaurus

Mats
type: Concept
broader: Cargo
in scheme: FISH Maritime Cargo Types Thesaurus
issued: 2021-11-19T14:33:00
license: http://creativecommons.org/licenses/by/3.0
attribution URL: http://www.historicengland.org.uk
attribution name: Historic England
publisher: www.historicengland.org.uk
scope note: Articles, usually woven from coarse fibres or made from hard wearing materials (eg. rubber or cork) used to protect the floor or for lying, sitting or kneeling on.

Government Stores
type: Concept
broader: Cargo
in scheme: FISH Maritime Cargo Types Thesaurus
issued: 2021-11-19T14:33:00
license: http://creativecommons.org/licenses/by/3.0
attribution URL: http://www.historicengland.org.uk
attribution name: Historic England
publisher: www.historicengland.org.uk
scope note: Supplies owned by, or for the use of, the government.

Jewels
type: Concept
broader: Cargo
in scheme: FISH Maritime Cargo Types Thesaurus
issued: 2021-11-19T14:33:00
license: http://creativecommons.org/licenses/by/3.0
attribution URL: http://www.historicengland.org.uk
attribution name: Historic England
publisher: www.historicengland.org.uk
scope note: Articles of value particularly those made with precious metals and precious stones, usually worn for adornment.

Ballast
type: Concept
broader: Cargo
in scheme: FISH Maritime Cargo Types Thesaurus
issued: 2021-11-19T14:33:00
license: http://creativecommons.org/licenses/by/3.0
attribution URL: http://www.historicengland.org.uk
attribution name: Historic England
publisher: www.historicengland.org.uk
scope note: A heavy substance, usually gravel, sand or lead, placed in the bilge of a ship or boat to provide stability.

Statues
type: Concept
broader: Cargo
in scheme: FISH Maritime Cargo Types Thesaurus
issued: 2021-11-19T14:33:00
license: http://creativecommons.org/licenses/by/3.0
attribution URL: http://www.historicengland.org.uk
attribution name: Historic England
publisher: www.historicengland.org.uk
scope note: A three dimensional representation of a figure, whether animal or human, produced by carving, casting sculpting or similar.

Animal Skins
type: Concept
broader: Animal Products
narrower: Hides
narrower: Furs
in scheme: FISH Maritime Cargo Types Thesaurus
issued: 2021-11-19T14:33:00
license: http://creativecommons.org/licenses/by/3.0
attribution URL: http://www.historicengland.org.uk
attribution name: Historic England
publisher: www.historicengland.org.uk
scope note: The hides of animals, either untreated or tanned.

Hides
type: Concept
broader: Animal Skins
in scheme: FISH Maritime Cargo Types Thesaurus
issued: 2021-11-19T14:33:00
license: http://creativecommons.org/licenses/by/3.0
attribution URL: http://www.historicengland.org.uk
attribution name: Historic England
publisher: www.historicengland.org.uk
scope note: Animal skins, either raw or dressed which are used in the tanning industry to produce leather.

Zinc Oxide
type: Concept
broader: Chemicals
in scheme: FISH Maritime Cargo Types Thesaurus
issued: 2021-11-19T14:33:00
license: http://creativecommons.org/licenses/by/3.0
attribution URL: http://www.historicengland.org.uk
attribution name: Historic England
publisher: www.historicengland.org.uk
scope note: A white powder used to colour medicines, paints etc.

Chemicals
type: Concept
narrower: Zinc Oxide
narrower: Drugs
narrower: Arsenic
narrower: Phosphate
narrower: Calcium Carbonate
narrower: Acid
narrower: Potassium Silicate
narrower: Soda Ash
narrower: Nitrate Of Soda
narrower: Sulphates
narrower: Sulphur
broader: Cargo
in scheme: FISH Maritime Cargo Types Thesaurus
issued: 2021-11-19T14:33:00
license: http://creativecommons.org/licenses/by/3.0
attribution URL: http://www.historicengland.org.uk
attribution name: Historic England
publisher: www.historicengland.org.uk
scope note: Substances, including acids, alkalis etc. obtained by or used in a chemical process.

Drugs
type: Concept
broader: Chemicals
in scheme: FISH Maritime Cargo Types Thesaurus
issued: 2021-11-19T14:33:00
license: http://creativecommons.org/licenses/by/3.0
attribution URL: http://www.historicengland.org.uk
attribution name: Historic England
publisher: www.historicengland.org.uk
scope note: A substance used to affect a human or animal by changing mental or physical states, particularly used in medicine.

Arsenic
type: Concept
broader: Chemicals
in scheme: FISH Maritime Cargo Types Thesaurus
issued: 2021-11-19T14:33:00
license: http://creativecommons.org/licenses/by/3.0
attribution URL: http://www.historicengland.org.uk
attribution name: Historic England
publisher: www.historicengland.org.uk
scope note: A semi metal, poisonous element used in a variety of industrial processes and in some medicinal preparations.

Phosphate
type: Concept
broader: Chemicals
in scheme: FISH Maritime Cargo Types Thesaurus
issued: 2021-11-19T14:33:00
license: http://creativecommons.org/licenses/by/3.0
attribution URL: http://www.historicengland.org.uk
attribution name: Historic England
publisher: www.historicengland.org.uk
scope note: Salts or organic derivatives of phosphoric acid, especially compounds of Calcium or Iron found in cereals and minerals.

Calcium Carbonate
type: Concept
broader: Chemicals
in scheme: FISH Maritime Cargo Types Thesaurus
issued: 2021-11-19T14:33:00
license: http://creativecommons.org/licenses/by/3.0
attribution URL: http://www.historicengland.org.uk
attribution name: Historic England
publisher: www.historicengland.org.uk
scope note: A natural compound used as in the building and medical industies.

Potassium Silicate
type: Concept
broader: Chemicals
in scheme: FISH Maritime Cargo Types Thesaurus
issued: 2021-11-19T14:33:00
license: http://creativecommons.org/licenses/by/3.0
attribution URL: http://www.historicengland.org.uk
attribution name: Historic England
publisher: www.historicengland.org.uk
scope note: A compound consisting of potassium and silica, used in various processes.

Soda Ash
type: Concept
broader: Chemicals
in scheme: FISH Maritime Cargo Types Thesaurus
issued: 2021-11-19T14:33:00
license: http://creativecommons.org/licenses/by/3.0
attribution URL: http://www.historicengland.org.uk
attribution name: Historic England
publisher: www.historicengland.org.uk
scope note: Commercially manufactured sodium carbonate used in glass and soap making.

Nitrate Of Soda
type: Concept
broader: Chemicals
in scheme: FISH Maritime Cargo Types Thesaurus
issued: 2021-11-19T14:33:00
license: http://creativecommons.org/licenses/by/3.0
attribution URL: http://www.historicengland.org.uk
attribution name: Historic England
publisher: www.historicengland.org.uk
scope note: A fertilizer containing nitrogen, derived from sodium nitrate.

Sulphur
type: Concept
broader: Chemicals
in scheme: FISH Maritime Cargo Types Thesaurus
issued: 2021-11-19T14:33:00
license: http://creativecommons.org/licenses/by/3.0
attribution URL: http://www.historicengland.org.uk
attribution name: Historic England
publisher: www.historicengland.org.uk
scope note: A non-metallic element, yellow in colour, used in a variety of processes.

Copper Ore
type: Concept
broader: Ore
in scheme: FISH Maritime Cargo Types Thesaurus
issued: 2021-11-19T14:33:00
license: http://creativecommons.org/licenses/by/3.0
attribution URL: http://www.historicengland.org.uk
attribution name: Historic England
publisher: www.historicengland.org.uk
scope note: A mineral containing high quantities of Copper.

Ore
type: Concept
narrower: Copper Ore
narrower: Iron Ore
narrower: Burnt Ore
narrower: Zinc Ore
narrower: Lead Ore
narrower: Mineral Ore
narrower: Bog Ore
narrower: Bauxite
narrower: Tin Ore
narrower: Antimony Ore
narrower: Purple Ore
broader: Minerals
in scheme: FISH Maritime Cargo Types Thesaurus
issued: 2021-11-19T14:33:00
license: http://creativecommons.org/licenses/by/3.0
attribution URL: http://www.historicengland.org.uk
attribution name: Historic England
publisher: www.historicengland.org.uk
scope note: An unprocessed mineral, collected for the extraction of metals or other substances contained within the mineral.

Burnt Ore
type: Concept
broader: Ore
in scheme: FISH Maritime Cargo Types Thesaurus
issued: 2021-11-19T14:33:00
license: http://creativecommons.org/licenses/by/3.0
attribution URL: http://www.historicengland.org.uk
attribution name: Historic England
publisher: www.historicengland.org.uk
scope note: Ore that has been burnt.

Zinc Ore
type: Concept
broader: Ore
in scheme: FISH Maritime Cargo Types Thesaurus
issued: 2021-11-19T14:33:00
license: http://creativecommons.org/licenses/by/3.0
attribution URL: http://www.historicengland.org.uk
attribution name: Historic England
publisher: www.historicengland.org.uk
scope note: Ore containing a high proportion of zinc.

Lead Ore
type: Concept
broader: Ore
in scheme: FISH Maritime Cargo Types Thesaurus
issued: 2021-11-19T14:33:00
license: http://creativecommons.org/licenses/by/3.0
attribution URL: http://www.historicengland.org.uk
attribution name: Historic England
publisher: www.historicengland.org.uk
scope note: Ore containing high levels of lead, eg. galena.

Bog Ore
type: Concept
broader: Ore
in scheme: FISH Maritime Cargo Types Thesaurus
issued: 2021-11-19T14:33:00
license: http://creativecommons.org/licenses/by/3.0
attribution URL: http://www.historicengland.org.uk
attribution name: Historic England
publisher: www.historicengland.org.uk
scope note: A form of limonite, found in wet ground, from which iron can be extracted.

Bauxite
type: Concept
broader: Ore
in scheme: FISH Maritime Cargo Types Thesaurus
issued: 2021-11-19T14:33:00
license: http://creativecommons.org/licenses/by/3.0
attribution URL: http://www.historicengland.org.uk
attribution name: Historic England
publisher: www.historicengland.org.uk
scope note: Mineral ore comprising mainly aluminium ore and mined for aluminium extraction.

Tin Ore
type: Concept
broader: Ore
in scheme: FISH Maritime Cargo Types Thesaurus
issued: 2021-11-19T14:33:00
license: http://creativecommons.org/licenses/by/3.0
attribution URL: http://www.historicengland.org.uk
attribution name: Historic England
publisher: www.historicengland.org.uk
scope note: Ore containing a high proportion of tin.

Antimony Ore
type: Concept
broader: Ore
in scheme: FISH Maritime Cargo Types Thesaurus
issued: 2021-11-19T14:33:00
license: http://creativecommons.org/licenses/by/3.0
attribution URL: http://www.historicengland.org.uk
attribution name: Historic England
publisher: www.historicengland.org.uk
scope note: An ore, such as stibnite, containing a high proportion of antimony.

Purple Ore
type: Concept
broader: Ore
in scheme: FISH Maritime Cargo Types Thesaurus
issued: 2021-11-19T14:33:00
license: http://creativecommons.org/licenses/by/3.0
attribution URL: http://www.historicengland.org.uk
attribution name: Historic England
publisher: www.historicengland.org.uk
scope note: A sulphide of copper and iron, reddish brown in colour.

Cotton Goods
type: Concept
broader: Cotton
in scheme: FISH Maritime Cargo Types Thesaurus
issued: 2021-11-19T14:33:00
license: http://creativecommons.org/licenses/by/3.0
attribution URL: http://www.historicengland.org.uk
attribution name: Historic England
publisher: www.historicengland.org.uk
scope note: Goods manufactured from processed cotton.

Cotton
type: Concept
narrower: Cotton Goods
narrower: Raw Cotton
narrower: Cotton Seed
broader: Plant Products
broader: Textiles
in scheme: FISH Maritime Cargo Types Thesaurus
issued: 2021-11-19T14:33:00
license: http://creativecommons.org/licenses/by/3.0
attribution URL: http://www.historicengland.org.uk
attribution name: Historic England
publisher: www.historicengland.org.uk
related: String
scope note: The white, fibrous substance surrounding the seeds of plants of the genus Gossypium, which can be spun and used in the manufacture of thread and cloth or used in its raw form as wadding or packing.

Raw Cotton
type: Concept
broader: Cotton
in scheme: FISH Maritime Cargo Types Thesaurus
issued: 2021-11-19T14:33:00
license: http://creativecommons.org/licenses/by/3.0
attribution URL: http://www.historicengland.org.uk
attribution name: Historic England
publisher: www.historicengland.org.uk
scope note: Cotton which has not been processed.

Figs
type: Concept
broader: Fruit
in scheme: FISH Maritime Cargo Types Thesaurus
issued: 2021-11-19T14:33:00
license: http://creativecommons.org/licenses/by/3.0
attribution URL: http://www.historicengland.org.uk
attribution name: Historic England
publisher: www.historicengland.org.uk
scope note: Soft, pear-shaped fruits of the Ficus carica tree. They can be eaten fresh or dried.

Fruit
type: Concept
narrower: Figs
narrower: Grapes
narrower: Oranges
narrower: Coconuts
narrower: Lemons
narrower: Olives
narrower: Nuts
narrower: Dried Fruit
narrower: Apples
narrower: Limes
broader: Food
in scheme: FISH Maritime Cargo Types Thesaurus
issued: 2021-11-19T14:33:00
license: http://creativecommons.org/licenses/by/3.0
attribution URL: http://www.historicengland.org.uk
attribution name: Historic England
publisher: www.historicengland.org.uk
scope note: The edible product of a plant, usually consisting of the seed and its sweet, juicy envelope.

Grapes
type: Concept
broader: Fruit
in scheme: FISH Maritime Cargo Types Thesaurus
issued: 2021-11-19T14:33:00
license: http://creativecommons.org/licenses/by/3.0
attribution URL: http://www.historicengland.org.uk
attribution name: Historic England
publisher: www.historicengland.org.uk
scope note: Edible fruit of the vine, which may be either red or white.

Oranges
type: Concept
broader: Fruit
in scheme: FISH Maritime Cargo Types Thesaurus
issued: 2021-11-19T14:33:00
license: http://creativecommons.org/licenses/by/3.0
attribution URL: http://www.historicengland.org.uk
attribution name: Historic England
publisher: www.historicengland.org.uk
scope note: Citrus fruit of a distinctive orange colour.

Lemons
type: Concept
broader: Fruit
in scheme: FISH Maritime Cargo Types Thesaurus
issued: 2021-11-19T14:33:00
license: http://creativecommons.org/licenses/by/3.0
attribution URL: http://www.historicengland.org.uk
attribution name: Historic England
publisher: www.historicengland.org.uk
scope note: Citrus fruit of a distinctive yellow colour.

Olives
type: Concept
broader: Fruit
in scheme: FISH Maritime Cargo Types Thesaurus
issued: 2021-11-19T14:33:00
license: http://creativecommons.org/licenses/by/3.0
attribution URL: http://www.historicengland.org.uk
attribution name: Historic England
publisher: www.historicengland.org.uk
scope note: Fruit native to the countries bordering the Mediterranean Sea.

Apples
type: Concept
broader: Fruit
in scheme: FISH Maritime Cargo Types Thesaurus
issued: 2021-11-19T14:33:00
license: http://creativecommons.org/licenses/by/3.0
attribution URL: http://www.historicengland.org.uk
attribution name: Historic England
publisher: www.historicengland.org.uk
scope note: The round, firm fleshed fruit of the apple (Malus Domestica) tree. Grown in numerous varieties throughout the world.

Limes
type: Concept
broader: Fruit
in scheme: FISH Maritime Cargo Types Thesaurus
issued: 2021-11-19T14:33:00
license: http://creativecommons.org/licenses/by/3.0
attribution URL: http://www.historicengland.org.uk
attribution name: Historic England
publisher: www.historicengland.org.uk
scope note: Citrus fruit, usually green.

Flint
type: Concept
broader: Stone
in scheme: FISH Maritime Cargo Types Thesaurus
issued: 2021-11-19T14:33:00
license: http://creativecommons.org/licenses/by/3.0
attribution URL: http://www.historicengland.org.uk
attribution name: Historic England
publisher: www.historicengland.org.uk
scope note: Stone consisting of nearly pure silica, which can be used as a building material or knapped to produce flint objects.

Stone
type: Concept
narrower: Flint
narrower: Gravel
narrower: Sand
narrower: Shingle
narrower: Pumice
narrower: Crushed Stone
narrower: Marble
narrower: Stone Products
narrower: Limestone
narrower: Slate
narrower: Granite
narrower: Aggregate
broader: Minerals
in scheme: FISH Maritime Cargo Types Thesaurus
issued: 2021-11-19T14:33:00
license: http://creativecommons.org/licenses/by/3.0
attribution URL: http://www.historicengland.org.uk
attribution name: Historic England
publisher: www.historicengland.org.uk
scope note: Rock or hard minerals used as a building material and for carving etc.

Gravel
type: Concept
broader: Stone
in scheme: FISH Maritime Cargo Types Thesaurus
issued: 2021-11-19T14:33:00
license: http://creativecommons.org/licenses/by/3.0
attribution URL: http://www.historicengland.org.uk
attribution name: Historic England
publisher: www.historicengland.org.uk
scope note: Small fragments of waterworn stone used in the construction industry.

Shingle
type: Concept
broader: Stone
in scheme: FISH Maritime Cargo Types Thesaurus
issued: 2021-11-19T14:33:00
license: http://creativecommons.org/licenses/by/3.0
attribution URL: http://www.historicengland.org.uk
attribution name: Historic England
publisher: www.historicengland.org.uk
scope note: Small stones which have been rounded usually by the action of sea water.

Crushed Stone
type: Concept
broader: Stone
in scheme: FISH Maritime Cargo Types Thesaurus
issued: 2021-11-19T14:33:00
license: http://creativecommons.org/licenses/by/3.0
attribution URL: http://www.historicengland.org.uk
attribution name: Historic England
publisher: www.historicengland.org.uk
scope note: Stone which has been crushed for use in the construction industry.

Limestone
type: Concept
broader: Stone
in scheme: FISH Maritime Cargo Types Thesaurus
issued: 2021-11-19T14:33:00
license: http://creativecommons.org/licenses/by/3.0
attribution URL: http://www.historicengland.org.uk
attribution name: Historic England
publisher: www.historicengland.org.uk
scope note: Stone composed mainly of calcium carbonate, used as a building material and in the production of cement.

Aggregate
type: Concept
broader: Stone
in scheme: FISH Maritime Cargo Types Thesaurus
issued: 2021-11-19T14:33:00
license: http://creativecommons.org/licenses/by/3.0
attribution URL: http://www.historicengland.org.uk
attribution name: Historic England
publisher: www.historicengland.org.uk
scope note: Material consisting of fragments of stone, sand, gravel, slag etc. used in the manufacture of concrete.

Hemp
type: Concept
broader: Plant Products
in scheme: FISH Maritime Cargo Types Thesaurus
issued: 2021-11-19T14:33:00
license: http://creativecommons.org/licenses/by/3.0
attribution URL: http://www.historicengland.org.uk
attribution name: Historic England
publisher: www.historicengland.org.uk
related: String
scope note: A herbaceous plant grown for its fibre and marijuana, a drug derivative. The fibres are used in the manufacture of rope.

Emigrants
type: Concept
broader: Passengers
in scheme: FISH Maritime Cargo Types Thesaurus
issued: 2021-11-19T14:33:00
license: http://creativecommons.org/licenses/by/3.0
attribution URL: http://www.historicengland.org.uk
attribution name: Historic England
publisher: www.historicengland.org.uk
scope note: People who leave their native country to settle in another, often for financial or religious reasons.

Passengers
type: Concept
narrower: Emigrants
narrower: Military Personnel
broader: People
in scheme: FISH Maritime Cargo Types Thesaurus
issued: 2021-11-19T14:33:00
license: http://creativecommons.org/licenses/by/3.0
attribution URL: http://www.historicengland.org.uk
attribution name: Historic England
publisher: www.historicengland.org.uk
scope note: People who have paid to travel on a vessel without having to work their passage.

Iron
type: Concept
broader: Metal
narrower: Ironmongery
narrower: Scrap Iron
narrower: Cast Iron
narrower: Iron Ingots
narrower: Osemund
narrower: Pig Iron
narrower: Iron Bars
in scheme: FISH Maritime Cargo Types Thesaurus
issued: 2021-11-19T14:33:00
license: http://creativecommons.org/licenses/by/3.0
attribution URL: http://www.historicengland.org.uk
attribution name: Historic England
publisher: www.historicengland.org.uk
related: Steel
scope note: A magnetic metal found abundantly in certain ores and widely used for the manufacture of tools, machinery etc. Iron is also a chief component of steel.

Ironmongery
type: Concept
broader: Iron
in scheme: FISH Maritime Cargo Types Thesaurus
issued: 2021-11-19T14:33:00
license: http://creativecommons.org/licenses/by/3.0
attribution URL: http://www.historicengland.org.uk
attribution name: Historic England
publisher: www.historicengland.org.uk
scope note: Goods, including machinery, manufactured from iron.

Scrap Iron
type: Concept
broader: Iron
in scheme: FISH Maritime Cargo Types Thesaurus
issued: 2021-11-19T14:33:00
license: http://creativecommons.org/licenses/by/3.0
attribution URL: http://www.historicengland.org.uk
attribution name: Historic England
publisher: www.historicengland.org.uk
scope note: Fragments of wrought or cast iron broken up for reprocessing.

Cast Iron
type: Concept
broader: Iron
in scheme: FISH Maritime Cargo Types Thesaurus
issued: 2021-11-19T14:33:00
license: http://creativecommons.org/licenses/by/3.0
attribution URL: http://www.historicengland.org.uk
attribution name: Historic England
publisher: www.historicengland.org.uk
scope note: A metallic alloy of iron, carbon and silicon formed by casting in a mould.

Iron Ingots
type: Concept
broader: Iron
in scheme: FISH Maritime Cargo Types Thesaurus
issued: 2021-11-19T14:33:00
license: http://creativecommons.org/licenses/by/3.0
attribution URL: http://www.historicengland.org.uk
attribution name: Historic England
publisher: www.historicengland.org.uk
scope note: Solid bars made from pure iron.

Osemund
type: Concept
broader: Iron
in scheme: FISH Maritime Cargo Types Thesaurus
issued: 2021-11-19T14:33:00
license: http://creativecommons.org/licenses/by/3.0
attribution URL: http://www.historicengland.org.uk
attribution name: Historic England
publisher: www.historicengland.org.uk
scope note: Also spelt "oszemundt" and other variants. Low-grade cast iron in the form of balls or spheres, produced in small workshops and exported across the North Sea and Baltic region. Particularly associated with 16th century Sweden.

Pig Iron
type: Concept
broader: Iron
in scheme: FISH Maritime Cargo Types Thesaurus
issued: 2021-11-19T14:33:00
license: http://creativecommons.org/licenses/by/3.0
attribution URL: http://www.historicengland.org.uk
attribution name: Historic England
publisher: www.historicengland.org.uk
scope note: Blocks of cast iron as it appears when first removed from the smelting furnace.

Iron Bars
type: Concept
broader: Iron
in scheme: FISH Maritime Cargo Types Thesaurus
issued: 2021-11-19T14:33:00
license: http://creativecommons.org/licenses/by/3.0
attribution URL: http://www.historicengland.org.uk
attribution name: Historic England
publisher: www.historicengland.org.uk
scope note: Iron, usually unworked, in the form of bars.

Metal
type: Concept
narrower: Iron
narrower: Copper
narrower: Pewter
narrower: Antimony
narrower: Gold
narrower: Bullion And Coin
narrower: Aluminium
narrower: Scrap Metal
narrower: Lead
narrower: Silver
narrower: Nickel
narrower: Steel
narrower: Bronze
narrower: Mercury
narrower: Zinc
narrower: Tin
narrower: Brass
broader: Cargo
in scheme: FISH Maritime Cargo Types Thesaurus
issued: 2021-11-19T14:33:00
license: http://creativecommons.org/licenses/by/3.0
attribution URL: http://www.historicengland.org.uk
attribution name: Historic England
publisher: www.historicengland.org.uk
scope note: Any material, including gold, silver, copper, tin etc. which is ductile, malleable, usually lustrous and a good conductor of heat and electricity.

Pewter
type: Concept
broader: Metal
in scheme: FISH Maritime Cargo Types Thesaurus
issued: 2021-11-19T14:33:00
license: http://creativecommons.org/licenses/by/3.0
attribution URL: http://www.historicengland.org.uk
attribution name: Historic England
publisher: www.historicengland.org.uk
scope note: An alloy, traditionally of tin and lead but now of tin, antimony and copper, used for domestic utensils.

Antimony
type: Concept
broader: Metal
in scheme: FISH Maritime Cargo Types Thesaurus
issued: 2021-11-19T14:33:00
license: http://creativecommons.org/licenses/by/3.0
attribution URL: http://www.historicengland.org.uk
attribution name: Historic England
publisher: www.historicengland.org.uk
scope note: A brittle silvery metallic element used in the manufacture of many alloys.

Scrap Metal
type: Concept
broader: Metal
in scheme: FISH Maritime Cargo Types Thesaurus
issued: 2021-11-19T14:33:00
license: http://creativecommons.org/licenses/by/3.0
attribution URL: http://www.historicengland.org.uk
attribution name: Historic England
publisher: www.historicengland.org.uk
scope note: Fragments of metal broken up and set aside for reprocessing.

Silver
type: Concept
broader: Metal
in scheme: FISH Maritime Cargo Types Thesaurus
issued: 2021-11-19T14:33:00
license: http://creativecommons.org/licenses/by/3.0
attribution URL: http://www.historicengland.org.uk
attribution name: Historic England
publisher: www.historicengland.org.uk
scope note: A precious metal, lustrous white in colour. Used for the manufacture of coins and other valuable items.

Nickel
type: Concept
broader: Metal
in scheme: FISH Maritime Cargo Types Thesaurus
issued: 2021-11-19T14:33:00
license: http://creativecommons.org/licenses/by/3.0
attribution URL: http://www.historicengland.org.uk
attribution name: Historic England
publisher: www.historicengland.org.uk
scope note: a hard metal used in a lot of alloys.

Bronze
type: Concept
broader: Metal
in scheme: FISH Maritime Cargo Types Thesaurus
issued: 2021-11-19T14:33:00
license: http://creativecommons.org/licenses/by/3.0
attribution URL: http://www.historicengland.org.uk
attribution name: Historic England
publisher: www.historicengland.org.uk
scope note: An alloy, principally of copper or tin, but which may also include zinc and/or lead.

Mercury
type: Concept
broader: Metal
in scheme: FISH Maritime Cargo Types Thesaurus
issued: 2021-11-19T14:33:00
license: http://creativecommons.org/licenses/by/3.0
attribution URL: http://www.historicengland.org.uk
attribution name: Historic England
publisher: www.historicengland.org.uk
scope note: A heavy, metallic element, which is liquid at room temperature. Used in thermometers and medicinal preparations.

Brass
type: Concept
broader: Metal
in scheme: FISH Maritime Cargo Types Thesaurus
issued: 2021-11-19T14:33:00
license: http://creativecommons.org/licenses/by/3.0
attribution URL: http://www.historicengland.org.uk
attribution name: Historic England
publisher: www.historicengland.org.uk
scope note: Originally a metallic alloy of copper and tin or zinc, now used solely for an alloy of copper and zinc.

Meat
type: Concept
broader: Food
narrower: Canned Meat
narrower: Beef
narrower: Pork
narrower: Bacon
narrower: Lard
in scheme: FISH Maritime Cargo Types Thesaurus
issued: 2021-11-19T14:33:00
license: http://creativecommons.org/licenses/by/3.0
attribution URL: http://www.historicengland.org.uk
attribution name: Historic England
publisher: www.historicengland.org.uk
scope note: The flesh of animals, either raw or cooked, used as food.

Beef
type: Concept
broader: Meat
in scheme: FISH Maritime Cargo Types Thesaurus
issued: 2021-11-19T14:33:00
license: http://creativecommons.org/licenses/by/3.0
attribution URL: http://www.historicengland.org.uk
attribution name: Historic England
publisher: www.historicengland.org.uk
scope note: The meat obtained from cattle.

Pork
type: Concept
broader: Meat
in scheme: FISH Maritime Cargo Types Thesaurus
issued: 2021-11-19T14:33:00
license: http://creativecommons.org/licenses/by/3.0
attribution URL: http://www.historicengland.org.uk
attribution name: Historic England
publisher: www.historicengland.org.uk
scope note: The flesh obtained from pigs eaten as food.

Bacon
type: Concept
broader: Meat
in scheme: FISH Maritime Cargo Types Thesaurus
issued: 2021-11-19T14:33:00
license: http://creativecommons.org/licenses/by/3.0
attribution URL: http://www.historicengland.org.uk
attribution name: Historic England
publisher: www.historicengland.org.uk
scope note: The cured flesh of a pig.

Lard
type: Concept
broader: Meat
in scheme: FISH Maritime Cargo Types Thesaurus
issued: 2021-11-19T14:33:00
license: http://creativecommons.org/licenses/by/3.0
attribution URL: http://www.historicengland.org.uk
attribution name: Historic England
publisher: www.historicengland.org.uk
scope note: A fatty substance derived from the fat of animals used in cooking.

Petroleum
type: Concept
broader: Oil Based Products
broader: Fuel
in scheme: FISH Maritime Cargo Types Thesaurus
issued: 2021-11-19T14:33:00
license: http://creativecommons.org/licenses/by/3.0
attribution URL: http://www.historicengland.org.uk
attribution name: Historic England
publisher: www.historicengland.org.uk
scope note: A dark, viscous liquid, obtained from the ground, which is refined for use as a fuel for motor vehicles and in generators to produce light and heat, and as a solvent.

Slaves
type: Concept
broader: People
in scheme: FISH Maritime Cargo Types Thesaurus
issued: 2021-11-19T14:33:00
license: http://creativecommons.org/licenses/by/3.0
attribution URL: http://www.historicengland.org.uk
attribution name: Historic England
publisher: www.historicengland.org.uk
scope note: People who are considered to be the property of someone else and who are bound to obedience.

People
type: Concept
narrower: Slaves
narrower: Convicts
narrower: Passengers
broader: Cargo
in scheme: FISH Maritime Cargo Types Thesaurus
issued: 2021-11-19T14:33:00
license: http://creativecommons.org/licenses/by/3.0
attribution URL: http://www.historicengland.org.uk
attribution name: Historic England
publisher: www.historicengland.org.uk
scope note: Human beings. Use more specific type where known.

Convicts
type: Concept
broader: People
in scheme: FISH Maritime Cargo Types Thesaurus
issued: 2021-11-19T14:33:00
license: http://creativecommons.org/licenses/by/3.0
attribution URL: http://www.historicengland.org.uk
attribution name: Historic England
publisher: www.historicengland.org.uk
scope note: People who have been convicted of criminal offences. Traditionally criminals, even those convicted of petty offences, were transported from Europe to penal colonies in the Americas and Australia.

Spices
type: Concept
broader: Spices And Seasonings
narrower: Nutmeg
narrower: Ginger
narrower: Cinnamon
narrower: Cloves
in scheme: FISH Maritime Cargo Types Thesaurus
issued: 2021-11-19T14:33:00
license: http://creativecommons.org/licenses/by/3.0
attribution URL: http://www.historicengland.org.uk
attribution name: Historic England
publisher: www.historicengland.org.uk
scope note: Aromatic vegetable substances, either in their natural form or ground, used to add flavour or scent to food.

Nutmeg
type: Concept
broader: Spices
in scheme: FISH Maritime Cargo Types Thesaurus
issued: 2021-11-19T14:33:00
license: http://creativecommons.org/licenses/by/3.0
attribution URL: http://www.historicengland.org.uk
attribution name: Historic England
publisher: www.historicengland.org.uk
scope note: A hard aromatic seed, obtained from the fruit of an East Indian evergreen tree and used as a spice.

Ginger
type: Concept
broader: Spices
in scheme: FISH Maritime Cargo Types Thesaurus
issued: 2021-11-19T14:33:00
license: http://creativecommons.org/licenses/by/3.0
attribution URL: http://www.historicengland.org.uk
attribution name: Historic England
publisher: www.historicengland.org.uk
scope note: The stem of the plant Zingiber officinale, with a characterisitc hot and peppery taste, used in cookery and medicine.

Cinnamon
type: Concept
broader: Spices
in scheme: FISH Maritime Cargo Types Thesaurus
issued: 2021-11-19T14:33:00
license: http://creativecommons.org/licenses/by/3.0
attribution URL: http://www.historicengland.org.uk
attribution name: Historic England
publisher: www.historicengland.org.uk
scope note: Spice from the bark of an East Indian tree

Cloves
type: Concept
broader: Spices
in scheme: FISH Maritime Cargo Types Thesaurus
issued: 2021-11-19T14:33:00
license: http://creativecommons.org/licenses/by/3.0
attribution URL: http://www.historicengland.org.uk
attribution name: Historic England
publisher: www.historicengland.org.uk
scope note: Dried flower buds, used as a pungent aromatic spice.

Spices And Seasonings
type: Concept
narrower: Spices
narrower: Seasonings
broader: Food
in scheme: FISH Maritime Cargo Types Thesaurus
issued: 2021-11-19T14:33:00
license: http://creativecommons.org/licenses/by/3.0
attribution URL: http://www.historicengland.org.uk
attribution name: Historic England
publisher: www.historicengland.org.uk
scope note: Various flavoured aromatic and savoury substances, such as herbs, salt etc, used to impart flavour to food.

Swords
type: Concept
broader: Munitions
in scheme: FISH Maritime Cargo Types Thesaurus
issued: 2021-11-19T14:33:00
license: http://creativecommons.org/licenses/by/3.0
attribution URL: http://www.historicengland.org.uk
attribution name: Historic England
publisher: www.historicengland.org.uk
scope note: Weapons used for cutting and thrusting, consisting of a blade and a hilt.

Munitions
type: Concept
narrower: Swords
narrower: Guns
narrower: Ammunition
narrower: Explosives
broader: Military Equipment
in scheme: FISH Maritime Cargo Types Thesaurus
issued: 2021-11-19T14:33:00
license: http://creativecommons.org/licenses/by/3.0
attribution URL: http://www.historicengland.org.uk
attribution name: Historic England
publisher: www.historicengland.org.uk
scope note: Military weapons, amunition and stores.

Whale Oil
type: Concept
broader: Animal Products
in scheme: FISH Maritime Cargo Types Thesaurus
issued: 2021-11-19T14:33:00
license: http://creativecommons.org/licenses/by/3.0
attribution URL: http://www.historicengland.org.uk
attribution name: Historic England
publisher: www.historicengland.org.uk
related: Blubber
scope note: Oil obtained from the rendered blubber of whales, used as a fuel in old oil lamps.

Wool
type: Concept
broader: Animal Products
broader: Textiles
narrower: Woollen Goods
in scheme: FISH Maritime Cargo Types Thesaurus
issued: 2021-11-19T14:33:00
license: http://creativecommons.org/licenses/by/3.0
attribution URL: http://www.historicengland.org.uk
attribution name: Historic England
publisher: www.historicengland.org.uk
related: Sheep
scope note: The hair from the coat of goats and sheep, made into yarn and used in the manufacture of woollen cloth.

Woollen Goods
type: Concept
broader: Wool
in scheme: FISH Maritime Cargo Types Thesaurus
issued: 2021-11-19T14:33:00
license: http://creativecommons.org/licenses/by/3.0
attribution URL: http://www.historicengland.org.uk
attribution name: Historic England
publisher: www.historicengland.org.uk
scope note: Goods, particularly cloth and garments, manufactured from wool.

Pottery
type: Concept
broader: Household Goods
narrower: Samian Ware
narrower: Earthenware
in scheme: FISH Maritime Cargo Types Thesaurus
issued: 2021-11-19T14:33:00
license: http://creativecommons.org/licenses/by/3.0
attribution URL: http://www.historicengland.org.uk
attribution name: Historic England
publisher: www.historicengland.org.uk
scope note: Ceramic vessels produced out of wet clay which is shaped ad dried or fired to harden. In some cases other materials like sand are added to the clay.

Samian Ware
type: Concept
broader: Pottery
in scheme: FISH Maritime Cargo Types Thesaurus
issued: 2021-11-19T14:33:00
license: http://creativecommons.org/licenses/by/3.0
attribution URL: http://www.historicengland.org.uk
attribution name: Historic England
publisher: www.historicengland.org.uk
scope note: Roman-era pottery, principally made in areas from modern-day France and Germany, for food use, with a characteristic glossy red surface and which may be either decorated or plain, and often produced in quantity as an export cargo.

Earthenware
type: Concept
broader: Pottery
in scheme: FISH Maritime Cargo Types Thesaurus
issued: 2021-11-19T14:33:00
license: http://creativecommons.org/licenses/by/3.0
attribution URL: http://www.historicengland.org.uk
attribution name: Historic England
publisher: www.historicengland.org.uk
scope note: Ceramic vessels made from potash, sand, feldspar and clay which is biscuit fired at a temperature of around 1000 degree Celsius. Usually glazed in order to become watertight.

Household Goods
type: Concept
narrower: Pottery
narrower: Starch
narrower: Candlesticks
narrower: Clocks
narrower: Mirrors
narrower: Matches
narrower: Furniture
narrower: Soap
narrower: Tableware
narrower: Candles
broader: Manufactured Goods
in scheme: FISH Maritime Cargo Types Thesaurus
issued: 2021-11-19T14:33:00
license: http://creativecommons.org/licenses/by/3.0
attribution URL: http://www.historicengland.org.uk
attribution name: Historic England
publisher: www.historicengland.org.uk
scope note: Goods, including portable objects and furniture, commonly found in the home.

Starch
type: Concept
broader: Household Goods
in scheme: FISH Maritime Cargo Types Thesaurus
issued: 2021-11-19T14:33:00
license: http://creativecommons.org/licenses/by/3.0
attribution URL: http://www.historicengland.org.uk
attribution name: Historic England
publisher: www.historicengland.org.uk
scope note: An odourless, tasteless powder obtained from cereals and potatoes, used for stiffening fabric.

Clocks
type: Concept
broader: Household Goods
in scheme: FISH Maritime Cargo Types Thesaurus
issued: 2021-11-19T14:33:00
license: http://creativecommons.org/licenses/by/3.0
attribution URL: http://www.historicengland.org.uk
attribution name: Historic England
publisher: www.historicengland.org.uk
scope note: Instruments for measuring and displaying time. Often manufactured as a piece of furniture e.g.a grandfather clock.

Mirrors
type: Concept
broader: Household Goods
in scheme: FISH Maritime Cargo Types Thesaurus
issued: 2021-11-19T14:33:00
license: http://creativecommons.org/licenses/by/3.0
attribution URL: http://www.historicengland.org.uk
attribution name: Historic England
publisher: www.historicengland.org.uk
scope note: "Looking glasses", up to and including the medieval period made of polished steel or other reflective metals; later a piece of glass with a reflective coating, e.g. silver or aluminium.

Matches
type: Concept
broader: Household Goods
in scheme: FISH Maritime Cargo Types Thesaurus
issued: 2021-11-19T14:33:00
license: http://creativecommons.org/licenses/by/3.0
attribution URL: http://www.historicengland.org.uk
attribution name: Historic England
publisher: www.historicengland.org.uk
scope note: Small pieces of wood, tipped with a chemical composition which ignites when rubbed against a rough or, if safety matches, prepared surface. Normally contained within a small box.

Furniture
type: Concept
broader: Household Goods
in scheme: FISH Maritime Cargo Types Thesaurus
issued: 2021-11-19T14:33:00
license: http://creativecommons.org/licenses/by/3.0
attribution URL: http://www.historicengland.org.uk
attribution name: Historic England
publisher: www.historicengland.org.uk
scope note: Movable, usually functional, articles normally found in the home.

Soap
type: Concept
broader: Household Goods
in scheme: FISH Maritime Cargo Types Thesaurus
issued: 2021-11-19T14:33:00
license: http://creativecommons.org/licenses/by/3.0
attribution URL: http://www.historicengland.org.uk
attribution name: Historic England
publisher: www.historicengland.org.uk
scope note: A cleansing agent, manufactured by reacting natural oils and fats with a strong alkali. Nowadays, formed into bars with added colouring and perfume.

Copper Pipes
type: Concept
broader: Pipes
in scheme: FISH Maritime Cargo Types Thesaurus
issued: 2021-11-19T14:33:00
license: http://creativecommons.org/licenses/by/3.0
attribution URL: http://www.historicengland.org.uk
attribution name: Historic England
publisher: www.historicengland.org.uk
scope note: Pipes manufactured from copper used for a variety of purposes, especially plumbing.

Pipes
type: Concept
narrower: Copper Pipes
narrower: Iron Pipes
narrower: Concrete Pipes
broader: Construction Materials
in scheme: FISH Maritime Cargo Types Thesaurus
issued: 2021-11-19T14:33:00
license: http://creativecommons.org/licenses/by/3.0
attribution URL: http://www.historicengland.org.uk
attribution name: Historic England
publisher: www.historicengland.org.uk
scope note: Hollow cylinders or tubes of ceramic, wood, plastic or metal used to convey liquids, gases etc. Used in a variety of industries.

Concrete Pipes
type: Concept
broader: Pipes
in scheme: FISH Maritime Cargo Types Thesaurus
issued: 2021-11-19T14:33:00
license: http://creativecommons.org/licenses/by/3.0
attribution URL: http://www.historicengland.org.uk
attribution name: Historic England
publisher: www.historicengland.org.uk
scope note: Pipes manufactured from concrete used in the construction industry for drainage etc.

Alcoholic Drink
type: Concept
broader: Liquids
narrower: Cider
narrower: Beer
narrower: Spirits
narrower: Wine
in scheme: FISH Maritime Cargo Types Thesaurus
issued: 2021-11-19T14:33:00
license: http://creativecommons.org/licenses/by/3.0
attribution URL: http://www.historicengland.org.uk
attribution name: Historic England
publisher: www.historicengland.org.uk
scope note: Drinks containing alcohol, an intoxicating substance found in fermented or distilled liquids.

Cider
type: Concept
broader: Alcoholic Drink
in scheme: FISH Maritime Cargo Types Thesaurus
issued: 2021-11-19T14:33:00
license: http://creativecommons.org/licenses/by/3.0
attribution URL: http://www.historicengland.org.uk
attribution name: Historic England
publisher: www.historicengland.org.uk
scope note: An alcoholic drink made from fermented apple juice.

Animal Hair
type: Concept
broader: Hair
broader: Animal Products
narrower: Mohair
narrower: Bristles
in scheme: FISH Maritime Cargo Types Thesaurus
issued: 2021-11-19T14:33:00
license: http://creativecommons.org/licenses/by/3.0
attribution URL: http://www.historicengland.org.uk
attribution name: Historic England
publisher: www.historicengland.org.uk
scope note: Hair taken from animals and used in a variety of manufacturing processes.

Mohair
type: Concept
broader: Animal Hair
in scheme: FISH Maritime Cargo Types Thesaurus
issued: 2021-11-19T14:33:00
license: http://creativecommons.org/licenses/by/3.0
attribution URL: http://www.historicengland.org.uk
attribution name: Historic England
publisher: www.historicengland.org.uk
scope note: Hair from the Angora goat

Bristles
type: Concept
broader: Animal Hair
in scheme: FISH Maritime Cargo Types Thesaurus
issued: 2021-11-19T14:33:00
license: http://creativecommons.org/licenses/by/3.0
attribution URL: http://www.historicengland.org.uk
attribution name: Historic England
publisher: www.historicengland.org.uk
scope note: Stiff hairs used in the manufacture of brushes.

Hair
type: Concept
narrower: Animal Hair
narrower: Human Hair
broader: Goods
in scheme: FISH Maritime Cargo Types Thesaurus
issued: 2021-11-19T14:33:00
license: http://creativecommons.org/licenses/by/3.0
attribution URL: http://www.historicengland.org.uk
attribution name: Historic England
publisher: www.historicengland.org.uk
scope note: The fine, keratinized, flexible filaments that grow from follicles beneath the surface of the skin in mammals.

Human Hair
type: Concept
broader: Hair
in scheme: FISH Maritime Cargo Types Thesaurus
issued: 2021-11-19T14:33:00
license: http://creativecommons.org/licenses/by/3.0
attribution URL: http://www.historicengland.org.uk
attribution name: Historic England
publisher: www.historicengland.org.uk
scope note: Cut human hair, usually intended for wig-making.

Beans
type: Concept
broader: Vegetables
in scheme: FISH Maritime Cargo Types Thesaurus
issued: 2021-11-19T14:33:00
license: http://creativecommons.org/licenses/by/3.0
attribution URL: http://www.historicengland.org.uk
attribution name: Historic England
publisher: www.historicengland.org.uk
scope note: Seeds of any of the various related plants of the leguminous plant Vicia faba.

Vegetables
type: Concept
narrower: Beans
narrower: Potatoes
narrower: Garlic
narrower: Peas
narrower: Lentils
narrower: Peppers
narrower: Onions
broader: Food
in scheme: FISH Maritime Cargo Types Thesaurus
issued: 2021-11-19T14:33:00
license: http://creativecommons.org/licenses/by/3.0
attribution URL: http://www.historicengland.org.uk
attribution name: Historic England
publisher: www.historicengland.org.uk
scope note: Any plants which are grown to be eaten. Includes parts of plants, especially roots and leaves.

Potatoes
type: Concept
broader: Vegetables
in scheme: FISH Maritime Cargo Types Thesaurus
issued: 2021-11-19T14:33:00
license: http://creativecommons.org/licenses/by/3.0
attribution URL: http://www.historicengland.org.uk
attribution name: Historic England
publisher: www.historicengland.org.uk
scope note: The edible tubers of plants of the family Ipomoea Batatas eaten as a vegetable.

Garlic
type: Concept
broader: Vegetables
in scheme: FISH Maritime Cargo Types Thesaurus
issued: 2021-11-19T14:33:00
license: http://creativecommons.org/licenses/by/3.0
attribution URL: http://www.historicengland.org.uk
attribution name: Historic England
publisher: www.historicengland.org.uk
scope note: The plant, Allium sativum, whose bulb is used for culinary purposes.

Peas
type: Concept
broader: Vegetables
in scheme: FISH Maritime Cargo Types Thesaurus
issued: 2021-11-19T14:33:00
license: http://creativecommons.org/licenses/by/3.0
attribution URL: http://www.historicengland.org.uk
attribution name: Historic England
publisher: www.historicengland.org.uk
scope note: The round seeds of the plant Pisum sativum which grow in pods and are eaten as a vegetable.

Lentils
type: Concept
broader: Vegetables
in scheme: FISH Maritime Cargo Types Thesaurus
issued: 2021-11-19T14:33:00
license: http://creativecommons.org/licenses/by/3.0
attribution URL: http://www.historicengland.org.uk
attribution name: Historic England
publisher: www.historicengland.org.uk
scope note: Small seeds of the leguminous plant Lens culinaris, eaten in stews and soups.

Onions
type: Concept
broader: Vegetables
in scheme: FISH Maritime Cargo Types Thesaurus
issued: 2021-11-19T14:33:00
license: http://creativecommons.org/licenses/by/3.0
attribution URL: http://www.historicengland.org.uk
attribution name: Historic England
publisher: www.historicengland.org.uk
scope note: The plant, Allium cepa, whose bulb is used, usually for culinary purposes.

Charcoal
type: Concept
broader: Timber
broader: Bones
in scheme: FISH Maritime Cargo Types Thesaurus
issued: 2021-11-19T14:33:00
license: http://creativecommons.org/licenses/by/3.0
attribution URL: http://www.historicengland.org.uk
attribution name: Historic England
publisher: www.historicengland.org.uk
scope note: Porous black residue of partly burnt wood, bones etc. used as fuel or, in the form of charcoal pencils, as a tool for drawing.

Toys
type: Concept
broader: Manufactured Goods
in scheme: FISH Maritime Cargo Types Thesaurus
issued: 2021-11-19T14:33:00
license: http://creativecommons.org/licenses/by/3.0
attribution URL: http://www.historicengland.org.uk
attribution name: Historic England
publisher: www.historicengland.org.uk
scope note: Objects designed to be played with, often a model or miniature replica of something and especially for a child.

Manufactured Goods
type: Concept
narrower: Toys
narrower: Weapons
narrower: Pens
narrower: Household Goods
narrower: Fishing Gear
narrower: Porcelain
narrower: Tools
narrower: Dress Accessories
narrower: Navigation Buoys
narrower: Perfume
narrower: Machinery
narrower: Navigational Instruments
narrower: Vehicles
narrower: Diving Equipment
narrower: Watches
narrower: Hand Bells
narrower: Springs
narrower: Ornaments
narrower: Beads
narrower: Fireworks
narrower: Chain
narrower: Armour
narrower: Jewellery
narrower: Glassware
narrower: Paint
narrower: Cosmetics
narrower: Telescopes
narrower: Musical Instruments
narrower: String
narrower: Horse Tack
broader: Cargo
in scheme: FISH Maritime Cargo Types Thesaurus
issued: 2021-11-19T14:33:00
license: http://creativecommons.org/licenses/by/3.0
attribution URL: http://www.historicengland.org.uk
attribution name: Historic England
publisher: www.historicengland.org.uk
scope note: Items that have been through a manufacturing process. Use specific type where known.

Pens
type: Concept
broader: Manufactured Goods
in scheme: FISH Maritime Cargo Types Thesaurus
issued: 2021-11-19T14:33:00
license: http://creativecommons.org/licenses/by/3.0
attribution URL: http://www.historicengland.org.uk
attribution name: Historic England
publisher: www.historicengland.org.uk
scope note: Writing implements; formerly quill pens made of bird feathers, and in more modern times fountain pens made of various materials with metal nibs, both used with ink to write.

Fishing Gear
type: Concept
broader: Manufactured Goods
in scheme: FISH Maritime Cargo Types Thesaurus
issued: 2021-11-19T14:33:00
license: http://creativecommons.org/licenses/by/3.0
attribution URL: http://www.historicengland.org.uk
attribution name: Historic England
publisher: www.historicengland.org.uk
scope note: Equipment used to catch fish

Porcelain
type: Concept
broader: Manufactured Goods
in scheme: FISH Maritime Cargo Types Thesaurus
issued: 2021-11-19T14:33:00
license: http://creativecommons.org/licenses/by/3.0
attribution URL: http://www.historicengland.org.uk
attribution name: Historic England
publisher: www.historicengland.org.uk
scope note: Hard semi-translucent ceramic material made out of kaolin, quartz and feldspar which is biscuit fired at around 1000 degrees Celsius and glaze fired at around 1300 degrees Celsius.

Navigation Buoys
type: Concept
broader: Manufactured Goods
in scheme: FISH Maritime Cargo Types Thesaurus
issued: 2021-11-19T14:33:00
license: http://creativecommons.org/licenses/by/3.0
attribution URL: http://www.historicengland.org.uk
attribution name: Historic England
publisher: www.historicengland.org.uk
scope note: Buoys used to direct craft on water along the correct route or away from a hazard. Usually used in coastal areas.

Perfume
type: Concept
broader: Manufactured Goods
in scheme: FISH Maritime Cargo Types Thesaurus
issued: 2021-11-19T14:33:00
license: http://creativecommons.org/licenses/by/3.0
attribution URL: http://www.historicengland.org.uk
attribution name: Historic England
publisher: www.historicengland.org.uk
scope note: A substance designed to emit a sweet smell.

Diving Equipment
type: Concept
broader: Manufactured Goods
in scheme: FISH Maritime Cargo Types Thesaurus
issued: 2021-11-19T14:33:00
license: http://creativecommons.org/licenses/by/3.0
attribution URL: http://www.historicengland.org.uk
attribution name: Historic England
publisher: www.historicengland.org.uk
scope note: Equipment including diving suits, wet suits, oxygen tanks etc. used to enable people to undertake underwater activities.

Springs
type: Concept
broader: Manufactured Goods
in scheme: FISH Maritime Cargo Types Thesaurus
issued: 2021-11-19T14:33:00
license: http://creativecommons.org/licenses/by/3.0
attribution URL: http://www.historicengland.org.uk
attribution name: Historic England
publisher: www.historicengland.org.uk
scope note: Coiled substance, usually metal or plastic, used to absorb shocks or in timepieces since it can stretch and return to its original shape.

Beads
type: Concept
broader: Manufactured Goods
in scheme: FISH Maritime Cargo Types Thesaurus
issued: 2021-11-19T14:33:00
license: http://creativecommons.org/licenses/by/3.0
attribution URL: http://www.historicengland.org.uk
attribution name: Historic England
publisher: www.historicengland.org.uk
scope note: Articles intended for personal adornment, usually to be strung on items of jewellery or sewn onto clothing. They may be made out of worked raw materials (eg. shells) or be manufactured goods, for example glass beads.

Fireworks
type: Concept
broader: Manufactured Goods
in scheme: FISH Maritime Cargo Types Thesaurus
issued: 2021-11-19T14:33:00
license: http://creativecommons.org/licenses/by/3.0
attribution URL: http://www.historicengland.org.uk
attribution name: Historic England
publisher: www.historicengland.org.uk
scope note: Explosive devices which produce spectacular visual effects when ignited.

Chain
type: Concept
broader: Manufactured Goods
in scheme: FISH Maritime Cargo Types Thesaurus
issued: 2021-11-19T14:33:00
license: http://creativecommons.org/licenses/by/3.0
attribution URL: http://www.historicengland.org.uk
attribution name: Historic England
publisher: www.historicengland.org.uk
scope note: A series of links joined together to form something that is flexible and strong. Usually metal, chains have a variety of uses but usually involve joining one item to another.

Glassware
type: Concept
broader: Manufactured Goods
in scheme: FISH Maritime Cargo Types Thesaurus
issued: 2021-11-19T14:33:00
license: http://creativecommons.org/licenses/by/3.0
attribution URL: http://www.historicengland.org.uk
attribution name: Historic England
publisher: www.historicengland.org.uk
scope note: Articles, particularly drinking vessels, manufactured from glass.

Paint
type: Concept
broader: Manufactured Goods
in scheme: FISH Maritime Cargo Types Thesaurus
issued: 2021-11-19T14:33:00
license: http://creativecommons.org/licenses/by/3.0
attribution URL: http://www.historicengland.org.uk
attribution name: Historic England
publisher: www.historicengland.org.uk
scope note: A liquid used to provide a protective or decorative cover to a surface.

Cosmetics
type: Concept
broader: Manufactured Goods
in scheme: FISH Maritime Cargo Types Thesaurus
issued: 2021-11-19T14:33:00
license: http://creativecommons.org/licenses/by/3.0
attribution URL: http://www.historicengland.org.uk
attribution name: Historic England
publisher: www.historicengland.org.uk
scope note: Preparations for beautifying or enhancing the body, face, hair or skin, e.g. creams, and coloured "make-up" items, e.g. rouge, lipstick, etc.

Horse Tack
type: Concept
broader: Manufactured Goods
in scheme: FISH Maritime Cargo Types Thesaurus
issued: 2021-11-19T14:33:00
license: http://creativecommons.org/licenses/by/3.0
attribution URL: http://www.historicengland.org.uk
attribution name: Historic England
publisher: www.historicengland.org.uk
scope note: Equipment enabling a horse to be ridden or driven, eg. saddles, bridles, harnesses, stirrups etc.

Stone Blocks
type: Concept
narrower: Gravestones
broader: Stone Products
in scheme: FISH Maritime Cargo Types Thesaurus
issued: 2021-11-19T14:33:00
license: http://creativecommons.org/licenses/by/3.0
attribution URL: http://www.historicengland.org.uk
attribution name: Historic England
publisher: www.historicengland.org.uk
scope note: Worked pieces of stone. Use more specific type of stone where known.

Weapons
type: Concept
broader: Manufactured Goods
broader: Military Equipment
in scheme: FISH Maritime Cargo Types Thesaurus
issued: 2021-11-19T14:33:00
license: http://creativecommons.org/licenses/by/3.0
attribution URL: http://www.historicengland.org.uk
attribution name: Historic England
publisher: www.historicengland.org.uk
scope note: Any form of arms or ammunition whether from a formal organized military context or as a general cargo. Use specific terms - e.g. swords, bombs, where known; otherwise use this term primarily in contexts where the arms are unspecified or ancient.

Stationery
type: Concept
broader: Paper And Paper Products
in scheme: FISH Maritime Cargo Types Thesaurus
issued: 2021-11-19T14:33:00
license: http://creativecommons.org/licenses/by/3.0
attribution URL: http://www.historicengland.org.uk
attribution name: Historic England
publisher: www.historicengland.org.uk
scope note: Paper products intended for note-taking or correspondence, e.g. blank notebooks, diaries, writing paper, postcards

Paper And Paper Products
type: Concept
narrower: Stationery
narrower: Bank Notes
narrower: Books
narrower: Paper Pulp
narrower: Paper
broader: Cargo
in scheme: FISH Maritime Cargo Types Thesaurus
issued: 2021-11-19T14:33:00
license: http://creativecommons.org/licenses/by/3.0
attribution URL: http://www.historicengland.org.uk
attribution name: Historic England
publisher: www.historicengland.org.uk
scope note: Includes all forms of paper and any products manufactured from it.

Bank Notes
type: Concept
broader: Paper And Paper Products
in scheme: FISH Maritime Cargo Types Thesaurus
issued: 2021-11-19T14:33:00
license: http://creativecommons.org/licenses/by/3.0
attribution URL: http://www.historicengland.org.uk
attribution name: Historic England
publisher: www.historicengland.org.uk
scope note: Paper currency. Bank notes may be of any denomination or value and of any nationality.

Books
type: Concept
broader: Paper And Paper Products
in scheme: FISH Maritime Cargo Types Thesaurus
issued: 2021-11-19T14:33:00
license: http://creativecommons.org/licenses/by/3.0
attribution URL: http://www.historicengland.org.uk
attribution name: Historic England
publisher: www.historicengland.org.uk
scope note: Documents written on sheets of paper or similar, collected together and bound between protective covers.

Paper Pulp
type: Concept
broader: Paper And Paper Products
in scheme: FISH Maritime Cargo Types Thesaurus
issued: 2021-11-19T14:33:00
license: http://creativecommons.org/licenses/by/3.0
attribution URL: http://www.historicengland.org.uk
attribution name: Historic England
publisher: www.historicengland.org.uk

Paper
type: Concept
broader: Paper And Paper Products
in scheme: FISH Maritime Cargo Types Thesaurus
issued: 2021-11-19T14:33:00
license: http://creativecommons.org/licenses/by/3.0
attribution URL: http://www.historicengland.org.uk
attribution name: Historic England
publisher: www.historicengland.org.uk
scope note: Thin sheets of material used for a variety of purposes such as writing on, painting on, or printing on.

Personal Effects
type: Concept
broader: General Cargo
in scheme: FISH Maritime Cargo Types Thesaurus
issued: 2021-11-19T14:33:00
license: http://creativecommons.org/licenses/by/3.0
attribution URL: http://www.historicengland.org.uk
attribution name: Historic England
publisher: www.historicengland.org.uk
scope note: Baggage, plate, money, clothes and other personal belongings of all kinds. Use only where the vessel is a cargo vessel conveying the goods of a person of consequence, e.g. a noble or diplomat, rather than for a general passenger vessel.

General Cargo
type: Concept
narrower: Personal Effects
narrower: Goods
broader: Cargo
in scheme: FISH Maritime Cargo Types Thesaurus
issued: 2021-11-19T14:33:00
license: http://creativecommons.org/licenses/by/3.0
attribution URL: http://www.historicengland.org.uk
attribution name: Historic England
publisher: www.historicengland.org.uk
scope note: Use for cargoes which are not specified.

Bulldozers
type: Concept
broader: Vehicles
in scheme: FISH Maritime Cargo Types Thesaurus
issued: 2021-11-19T14:33:00
license: http://creativecommons.org/licenses/by/3.0
attribution URL: http://www.historicengland.org.uk
attribution name: Historic England
publisher: www.historicengland.org.uk
scope note: Heavy caterpillar tractors fitted with broad blades to the front for moving or levelling earth and obstacles.

Vehicles
type: Concept
narrower: Bulldozers
narrower: Tyres
narrower: Aircraft
narrower: Locomotives
narrower: Rolling Stock
narrower: Military Vehicles
narrower: Bicycles
broader: Manufactured Goods
in scheme: FISH Maritime Cargo Types Thesaurus
issued: 2021-11-19T14:33:00
license: http://creativecommons.org/licenses/by/3.0
attribution URL: http://www.historicengland.org.uk
attribution name: Historic England
publisher: www.historicengland.org.uk
scope note: Transportation, usually wheeled or tracked, used for the conveyance of goods or people.

Tyres
type: Concept
broader: Vehicles
in scheme: FISH Maritime Cargo Types Thesaurus
issued: 2021-11-19T14:33:00
license: http://creativecommons.org/licenses/by/3.0
attribution URL: http://www.historicengland.org.uk
attribution name: Historic England
publisher: www.historicengland.org.uk
scope note: A hoop or band of material put around a wheel to protect it and, when filled with air, to provide a more comfortable ride.

Locomotives
type: Concept
broader: Vehicles
in scheme: FISH Maritime Cargo Types Thesaurus
issued: 2021-11-19T14:33:00
license: http://creativecommons.org/licenses/by/3.0
attribution URL: http://www.historicengland.org.uk
attribution name: Historic England
publisher: www.historicengland.org.uk
scope note: Railway engines designed to travel under its own power and to draw railway carriages and rolling stock.

Landing Craft
type: Concept
broader: Military Vehicles
in scheme: FISH Maritime Cargo Types Thesaurus
issued: 2021-11-19T14:33:00
license: http://creativecommons.org/licenses/by/3.0
attribution URL: http://www.historicengland.org.uk
attribution name: Historic England
publisher: www.historicengland.org.uk
scope note: Inshore craft used for carrying troops and military equipment used either for beach landings or as a ferry; as cargo smaller landing craft could be carried aboard larger craft in the D-Day operations, for example.

Military Vehicles
type: Concept
narrower: Landing Craft
narrower: Tanks
broader: Military Equipment
broader: Vehicles
in scheme: FISH Maritime Cargo Types Thesaurus
issued: 2021-11-19T14:33:00
license: http://creativecommons.org/licenses/by/3.0
attribution URL: http://www.historicengland.org.uk
attribution name: Historic England
publisher: www.historicengland.org.uk
scope note: Vehicles owned or used by the armed forces. Includes tanks, armoured vehicles as well as civilian vehicles in use by the military eg. ambulances.

Palm Kernels
type: Concept
broader: Plant Products
broader: Food
in scheme: FISH Maritime Cargo Types Thesaurus
issued: 2021-11-19T14:33:00
license: http://creativecommons.org/licenses/by/3.0
attribution URL: http://www.historicengland.org.uk
attribution name: Historic England
publisher: www.historicengland.org.uk
scope note: The edible seed of the palm tree.

Crude Oil
type: Concept
broader: Oil
in scheme: FISH Maritime Cargo Types Thesaurus
issued: 2021-11-19T14:33:00
license: http://creativecommons.org/licenses/by/3.0
attribution URL: http://www.historicengland.org.uk
attribution name: Historic England
publisher: www.historicengland.org.uk
scope note: Unrefined oil used in the manufacture of petroleum.

Oil
type: Concept
narrower: Crude Oil
narrower: Lubricating Oil
broader: Oil Based Products
in scheme: FISH Maritime Cargo Types Thesaurus
issued: 2021-11-19T14:33:00
license: http://creativecommons.org/licenses/by/3.0
attribution URL: http://www.historicengland.org.uk
attribution name: Historic England
publisher: www.historicengland.org.uk
scope note: A smooth, flammable liquid, produced naturally or from plants or animals, and used for a variety of purposes.

Lubricating Oil
type: Concept
broader: Oil
in scheme: FISH Maritime Cargo Types Thesaurus
issued: 2021-11-19T14:33:00
license: http://creativecommons.org/licenses/by/3.0
attribution URL: http://www.historicengland.org.uk
attribution name: Historic England
publisher: www.historicengland.org.uk
scope note: Oil used to lubricate moving parts, particularly in machinery.

Iron Ore
type: Concept
broader: Ore
narrower: Ironstone
in scheme: FISH Maritime Cargo Types Thesaurus
issued: 2021-11-19T14:33:00
license: http://creativecommons.org/licenses/by/3.0
attribution URL: http://www.historicengland.org.uk
attribution name: Historic England
publisher: www.historicengland.org.uk
scope note: Ore containing high proportions of Iron.

Ironstone
type: Concept
broader: Iron Ore
in scheme: FISH Maritime Cargo Types Thesaurus
issued: 2021-11-19T14:33:00
license: http://creativecommons.org/licenses/by/3.0
attribution URL: http://www.historicengland.org.uk
attribution name: Historic England
publisher: www.historicengland.org.uk
scope note: Hard iron ores

Linen
type: Concept
broader: Textiles
in scheme: FISH Maritime Cargo Types Thesaurus
issued: 2021-11-19T14:33:00
license: http://creativecommons.org/licenses/by/3.0
attribution URL: http://www.historicengland.org.uk
attribution name: Historic England
publisher: www.historicengland.org.uk
related: Flax
scope note: A cloth woven from flax.

Slag
type: Concept
broader: Fertilizer And Waste
in scheme: FISH Maritime Cargo Types Thesaurus
issued: 2021-11-19T14:33:00
license: http://creativecommons.org/licenses/by/3.0
attribution URL: http://www.historicengland.org.uk
attribution name: Historic England
publisher: www.historicengland.org.uk
scope note: A waste product from smelting metal.

Fertilizer And Waste
type: Concept
narrower: Slag
narrower: Mud
narrower: Guano
narrower: Fertilizer
narrower: Soil
narrower: Rubbish
narrower: Industrial Waste
narrower: Sludge
narrower: Sewage
narrower: Clinker
broader: Cargo
in scheme: FISH Maritime Cargo Types Thesaurus
issued: 2021-11-19T14:33:00
license: http://creativecommons.org/licenses/by/3.0
attribution URL: http://www.historicengland.org.uk
attribution name: Historic England
publisher: www.historicengland.org.uk
scope note: Includes chemical and natural fertilizers and waste products. use more specific term.

Mud
type: Concept
broader: Fertilizer And Waste
in scheme: FISH Maritime Cargo Types Thesaurus
issued: 2021-11-19T14:33:00
license: http://creativecommons.org/licenses/by/3.0
attribution URL: http://www.historicengland.org.uk
attribution name: Historic England
publisher: www.historicengland.org.uk
scope note: Soft, damp soil.

Guano
type: Concept
broader: Fertilizer And Waste
in scheme: FISH Maritime Cargo Types Thesaurus
issued: 2021-11-19T14:33:00
license: http://creativecommons.org/licenses/by/3.0
attribution URL: http://www.historicengland.org.uk
attribution name: Historic England
publisher: www.historicengland.org.uk
scope note: The excrement of seabirds and bats used as a fertilizer.

Rubbish
type: Concept
broader: Fertilizer And Waste
in scheme: FISH Maritime Cargo Types Thesaurus
issued: 2021-11-19T14:33:00
license: http://creativecommons.org/licenses/by/3.0
attribution URL: http://www.historicengland.org.uk
attribution name: Historic England
publisher: www.historicengland.org.uk
scope note: Waste material.

Industrial Waste
type: Concept
broader: Fertilizer And Waste
in scheme: FISH Maritime Cargo Types Thesaurus
issued: 2021-11-19T14:33:00
license: http://creativecommons.org/licenses/by/3.0
attribution URL: http://www.historicengland.org.uk
attribution name: Historic England
publisher: www.historicengland.org.uk
scope note: Waste material resulting from industrial manufacturing processes.

Sludge
type: Concept
broader: Fertilizer And Waste
in scheme: FISH Maritime Cargo Types Thesaurus
issued: 2021-11-19T14:33:00
license: http://creativecommons.org/licenses/by/3.0
attribution URL: http://www.historicengland.org.uk
attribution name: Historic England
publisher: www.historicengland.org.uk
scope note: Mud, which has often been dredged from the beds of rivers.

Sewage
type: Concept
broader: Fertilizer And Waste
in scheme: FISH Maritime Cargo Types Thesaurus
issued: 2021-11-19T14:33:00
license: http://creativecommons.org/licenses/by/3.0
attribution URL: http://www.historicengland.org.uk
attribution name: Historic England
publisher: www.historicengland.org.uk
scope note: Waste matter, usually liquid in form, consisting of the contents of sewers and cesspits.

Clinker
type: Concept
broader: Fertilizer And Waste
in scheme: FISH Maritime Cargo Types Thesaurus
issued: 2021-11-19T14:33:00
license: http://creativecommons.org/licenses/by/3.0
attribution URL: http://www.historicengland.org.uk
attribution name: Historic England
publisher: www.historicengland.org.uk
scope note: Usually slag, a residue from burning stone, but can be used for vitrified bricks.

Yarn
type: Concept
broader: Textiles And Clothing
in scheme: FISH Maritime Cargo Types Thesaurus
issued: 2021-11-19T14:33:00
license: http://creativecommons.org/licenses/by/3.0
attribution URL: http://www.historicengland.org.uk
attribution name: Historic England
publisher: www.historicengland.org.uk
scope note: Threads prepared for use in a manufacturing process such as spinning, weaving etc.

Textiles And Clothing
type: Concept
narrower: Yarn
narrower: Lace
narrower: Textiles
narrower: Clothing
broader: Cargo
in scheme: FISH Maritime Cargo Types Thesaurus
issued: 2021-11-19T14:33:00
license: http://creativecommons.org/licenses/by/3.0
attribution URL: http://www.historicengland.org.uk
attribution name: Historic England
publisher: www.historicengland.org.uk
scope note: Clothing, cloth and woven fabric manufactured from either natural or artificial fibres.

Lace
type: Concept
broader: Textiles And Clothing
in scheme: FISH Maritime Cargo Types Thesaurus
issued: 2021-11-19T14:33:00
license: http://creativecommons.org/licenses/by/3.0
attribution URL: http://www.historicengland.org.uk
attribution name: Historic England
publisher: www.historicengland.org.uk
scope note: An ornate, openwork fabric made by twisting, knotting or looping threads. Originally made by hand but more recently manufactured mechanically.

Cochineal
type: Concept
broader: Pigment
in scheme: FISH Maritime Cargo Types Thesaurus
issued: 2021-11-19T14:33:00
license: http://creativecommons.org/licenses/by/3.0
attribution URL: http://www.historicengland.org.uk
attribution name: Historic England
publisher: www.historicengland.org.uk
scope note: A red dye made from the dried bodies of the insect Dactylopius coccus.

Pigment
type: Concept
narrower: Cochineal
narrower: Ochre
narrower: Woad
broader: Cargo
in scheme: FISH Maritime Cargo Types Thesaurus
issued: 2021-11-19T14:33:00
license: http://creativecommons.org/licenses/by/3.0
attribution URL: http://www.historicengland.org.uk
attribution name: Historic England
publisher: www.historicengland.org.uk
scope note: Colour or dye, often in powder form, from natural mineral or vegetable sources (e.g. ochre) or created through chemical process (e.g. lamp black).

Railway Sleepers
type: Concept
broader: Railway Components
in scheme: FISH Maritime Cargo Types Thesaurus
issued: 2021-11-19T14:33:00
license: http://creativecommons.org/licenses/by/3.0
attribution URL: http://www.historicengland.org.uk
attribution name: Historic England
publisher: www.historicengland.org.uk
scope note: Large blocks of timber used to support railway tracks.

Railway Components
type: Concept
narrower: Railway Sleepers
narrower: Railway Track
narrower: Rolling Stock
broader: Cargo
in scheme: FISH Maritime Cargo Types Thesaurus
issued: 2021-11-19T14:33:00
license: http://creativecommons.org/licenses/by/3.0
attribution URL: http://www.historicengland.org.uk
attribution name: Historic England
publisher: www.historicengland.org.uk
scope note: Equipment and parts used in the manufacture of railway tracks, locomotives and rolling stock.

Railway Track
type: Concept
broader: Railway Components
in scheme: FISH Maritime Cargo Types Thesaurus
issued: 2021-11-19T14:33:00
license: http://creativecommons.org/licenses/by/3.0
attribution URL: http://www.historicengland.org.uk
attribution name: Historic England
publisher: www.historicengland.org.uk
scope note: Rolled iron or steel formed into rails.

Ship Fittings
type: Concept
narrower: Spars
narrower: Masts
narrower: Anchors
broader: Cargo
in scheme: FISH Maritime Cargo Types Thesaurus
issued: 2021-11-19T14:33:00
license: http://creativecommons.org/licenses/by/3.0
attribution URL: http://www.historicengland.org.uk
attribution name: Historic England
publisher: www.historicengland.org.uk
scope note: Materials used to equip and fit out a ship. Includes masts, spars, rigging etc. Use only where evidence is less specific, otherwise use most relevant term.

Masts
type: Concept
broader: Ship Fittings
in scheme: FISH Maritime Cargo Types Thesaurus
issued: 2021-11-19T14:33:00
license: http://creativecommons.org/licenses/by/3.0
attribution URL: http://www.historicengland.org.uk
attribution name: Historic England
publisher: www.historicengland.org.uk
scope note: Long poles or spars, usually set vertically, on sailing boats and ships to support the sails.

Anchors
type: Concept
broader: Ship Fittings
in scheme: FISH Maritime Cargo Types Thesaurus
issued: 2021-11-19T14:33:00
license: http://creativecommons.org/licenses/by/3.0
attribution URL: http://www.historicengland.org.uk
attribution name: Historic England
publisher: www.historicengland.org.uk
scope note: Structures, traditonally consisting of a long shank with two arms at one end and a ring to attach to cable at the other, used to hold a ship in one place by mooring it to the bottom of the sea. Usually made of stone or metal.

Whiting
type: Concept
broader: Fish
in scheme: FISH Maritime Cargo Types Thesaurus
issued: 2021-11-19T14:33:00
license: http://creativecommons.org/licenses/by/3.0
attribution URL: http://www.historicengland.org.uk
attribution name: Historic England
publisher: www.historicengland.org.uk
scope note: Small fish, common in European waters, caught for food.

Fish
type: Concept
narrower: Whiting
narrower: Live Fish
narrower: Herring
narrower: Cod
narrower: Shellfish
narrower: Dried Fish
narrower: Pilchards
narrower: Salmon
narrower: Salted Fish
broader: Food
broader: Animals
in scheme: FISH Maritime Cargo Types Thesaurus
issued: 2021-11-19T14:33:00
license: http://creativecommons.org/licenses/by/3.0
attribution URL: http://www.historicengland.org.uk
attribution name: Historic England
publisher: www.historicengland.org.uk
scope note: Any of a large group of cold blooded vertebrates who live exclusively in water. Also can refer to the flesh of fish which is eaten.

Live Fish
type: Concept
broader: Fish
in scheme: FISH Maritime Cargo Types Thesaurus
issued: 2021-11-19T14:33:00
license: http://creativecommons.org/licenses/by/3.0
attribution URL: http://www.historicengland.org.uk
attribution name: Historic England
publisher: www.historicengland.org.uk
scope note: Fish which have been caught and kept alive. Fish were kept alive on ships in earlier centuries to ensure they reached their destination as fresh as possible. In more recent times exotic fish have been kept alive to sell as pets.

Herring
type: Concept
broader: Fish
in scheme: FISH Maritime Cargo Types Thesaurus
issued: 2021-11-19T14:33:00
license: http://creativecommons.org/licenses/by/3.0
attribution URL: http://www.historicengland.org.uk
attribution name: Historic England
publisher: www.historicengland.org.uk
scope note: Fish of the family Clupeidae, common to the North Atlantic. They are caught for food.

Cod
type: Concept
broader: Fish
in scheme: FISH Maritime Cargo Types Thesaurus
issued: 2021-11-19T14:33:00
license: http://creativecommons.org/licenses/by/3.0
attribution URL: http://www.historicengland.org.uk
attribution name: Historic England
publisher: www.historicengland.org.uk
scope note: Large fish, native to the North Atlantic and adjacents seas which has been fished since the Middle Ages.

Dried Fish
type: Concept
broader: Fish
in scheme: FISH Maritime Cargo Types Thesaurus
issued: 2021-11-19T14:33:00
license: http://creativecommons.org/licenses/by/3.0
attribution URL: http://www.historicengland.org.uk
attribution name: Historic England
publisher: www.historicengland.org.uk
scope note: Fish which has been preserved by drying.

Pilchards
type: Concept
broader: Fish
in scheme: FISH Maritime Cargo Types Thesaurus
issued: 2021-11-19T14:33:00
license: http://creativecommons.org/licenses/by/3.0
attribution URL: http://www.historicengland.org.uk
attribution name: Historic England
publisher: www.historicengland.org.uk
scope note: Small fish, Sardina pilchardus, common to European waters and eaten as a food fish.

Coal Tar
type: Concept
broader: Coal
in scheme: FISH Maritime Cargo Types Thesaurus
issued: 2021-11-19T14:33:00
license: http://creativecommons.org/licenses/by/3.0
attribution URL: http://www.historicengland.org.uk
attribution name: Historic England
publisher: www.historicengland.org.uk
scope note: Thick, black liquid distilled from bituminous coal, and containing many organic chemicals.

Coal
type: Concept
narrower: Coal Tar
narrower: Patent Fuel
narrower: Anthracite
narrower: Coal Dust
narrower: Coke
broader: Fuel
in scheme: FISH Maritime Cargo Types Thesaurus
issued: 2021-11-19T14:33:00
license: http://creativecommons.org/licenses/by/3.0
attribution URL: http://www.historicengland.org.uk
attribution name: Historic England
publisher: www.historicengland.org.uk
scope note: Hard, black, carbonized plant matter, usually found in seams below the earth's surface and used as a fuel and for the manufacture of gas.

Anthracite
type: Concept
broader: Coal
in scheme: FISH Maritime Cargo Types Thesaurus
issued: 2021-11-19T14:33:00
license: http://creativecommons.org/licenses/by/3.0
attribution URL: http://www.historicengland.org.uk
attribution name: Historic England
publisher: www.historicengland.org.uk
scope note: Non bituminous coal

Coke
type: Concept
broader: Coal
in scheme: FISH Maritime Cargo Types Thesaurus
issued: 2021-11-19T14:33:00
license: http://creativecommons.org/licenses/by/3.0
attribution URL: http://www.historicengland.org.uk
attribution name: Historic England
publisher: www.historicengland.org.uk
scope note: A fuel derived by dry distillation from coal.

Bullion And Coin
type: Concept
narrower: Coin
narrower: Bullion
broader: Metal
in scheme: FISH Maritime Cargo Types Thesaurus
issued: 2021-11-19T14:33:00
license: http://creativecommons.org/licenses/by/3.0
attribution URL: http://www.historicengland.org.uk
attribution name: Historic England
publisher: www.historicengland.org.uk
scope note: Metal, either precious or base, in the form of bars and coins. Use more specific type.

Flax
type: Concept
broader: Plant Products
in scheme: FISH Maritime Cargo Types Thesaurus
issued: 2021-11-19T14:33:00
license: http://creativecommons.org/licenses/by/3.0
attribution URL: http://www.historicengland.org.uk
attribution name: Historic England
publisher: www.historicengland.org.uk
related: Linen
scope note: The fibrous stalks of the plant, Linum usitatissimum, which can be processed and used to manufacture linen.

Fuel
type: Concept
broader: Cargo
narrower: Petroleum
narrower: Peat
narrower: Paraffin
narrower: Coal
narrower: Diesel
narrower: Gas
narrower: Gas Oil
in scheme: FISH Maritime Cargo Types Thesaurus
issued: 2021-11-19T14:33:00
license: http://creativecommons.org/licenses/by/3.0
attribution URL: http://www.historicengland.org.uk
attribution name: Historic England
publisher: www.historicengland.org.uk
scope note: Materials or substances, including petrol, firewood etc., used as a source of heat or power.

Peat
type: Concept
broader: Fuel
in scheme: FISH Maritime Cargo Types Thesaurus
issued: 2021-11-19T14:33:00
license: http://creativecommons.org/licenses/by/3.0
attribution URL: http://www.historicengland.org.uk
attribution name: Historic England
publisher: www.historicengland.org.uk
scope note: Vegetable matter decomposed in water and partially carbonized to form bogs, whence slabs are cut out to use as fuel.

Diesel
type: Concept
broader: Fuel
in scheme: FISH Maritime Cargo Types Thesaurus
issued: 2021-11-19T14:33:00
license: http://creativecommons.org/licenses/by/3.0
attribution URL: http://www.historicengland.org.uk
attribution name: Historic England
publisher: www.historicengland.org.uk
scope note: An oil based derivative used as a fuel in diesel engines.

Gas
type: Concept
broader: Fuel
in scheme: FISH Maritime Cargo Types Thesaurus
issued: 2021-11-19T14:33:00
license: http://creativecommons.org/licenses/by/3.0
attribution URL: http://www.historicengland.org.uk
attribution name: Historic England
publisher: www.historicengland.org.uk
scope note: An airlike, fluid hydrocarbon suitable for burning to produce light, heat or power.

Gas Oil
type: Concept
broader: Fuel
in scheme: FISH Maritime Cargo Types Thesaurus
issued: 2021-11-19T14:33:00
license: http://creativecommons.org/licenses/by/3.0
attribution URL: http://www.historicengland.org.uk
attribution name: Historic England
publisher: www.historicengland.org.uk
scope note: A liquid distilled from petroleum.

Lime
type: Concept
broader: Stone Products
in scheme: FISH Maritime Cargo Types Thesaurus
issued: 2021-11-19T14:33:00
license: http://creativecommons.org/licenses/by/3.0
attribution URL: http://www.historicengland.org.uk
attribution name: Historic England
publisher: www.historicengland.org.uk
scope note: A white, caustic solid obtained by heating limestone and used in the preparation of mortar and cement.

Stone Products
type: Concept
narrower: Lime
narrower: Kerbstones
narrower: Stone Blocks
narrower: Roofing Slate
narrower: Stone Dust
narrower: Paving Stones
broader: Stone
in scheme: FISH Maritime Cargo Types Thesaurus
issued: 2021-11-19T14:33:00
license: http://creativecommons.org/licenses/by/3.0
attribution URL: http://www.historicengland.org.uk
attribution name: Historic England
publisher: www.historicengland.org.uk
scope note: Products manufactured from stone.

Kerbstones
type: Concept
broader: Stone Products
in scheme: FISH Maritime Cargo Types Thesaurus
issued: 2021-11-19T14:33:00
license: http://creativecommons.org/licenses/by/3.0
attribution URL: http://www.historicengland.org.uk
attribution name: Historic England
publisher: www.historicengland.org.uk
scope note: Stones used to edge a pavement or raised path.

Stone Dust
type: Concept
broader: Stone Products
in scheme: FISH Maritime Cargo Types Thesaurus
issued: 2021-11-19T14:33:00
license: http://creativecommons.org/licenses/by/3.0
attribution URL: http://www.historicengland.org.uk
attribution name: Historic England
publisher: www.historicengland.org.uk
scope note: Powder made from particles of stone used in mining to make the coal dust in the air less combustible.

Rope
type: Concept
broader: Cordage
in scheme: FISH Maritime Cargo Types Thesaurus
issued: 2021-11-19T14:33:00
license: http://creativecommons.org/licenses/by/3.0
attribution URL: http://www.historicengland.org.uk
attribution name: Historic England
publisher: www.historicengland.org.uk
scope note: A cord manufactured by twisting strands of material, such as flax, cotton, nylon etc., together to form a strong line.

Cordage
type: Concept
narrower: Rope
narrower: Wire
narrower: Cable
broader: Cargo
in scheme: FISH Maritime Cargo Types Thesaurus
issued: 2021-11-19T14:33:00
license: http://creativecommons.org/licenses/by/3.0
attribution URL: http://www.historicengland.org.uk
attribution name: Historic England
publisher: www.historicengland.org.uk
scope note: Thick ropes and rigging.

Soldiers
type: Concept
broader: Military Personnel
in scheme: FISH Maritime Cargo Types Thesaurus
issued: 2021-11-19T14:33:00
license: http://creativecommons.org/licenses/by/3.0
attribution URL: http://www.historicengland.org.uk
attribution name: Historic England
publisher: www.historicengland.org.uk
scope note: People who serve as members of an army.

Military Personnel
type: Concept
narrower: Soldiers
narrower: Prisoners Of War
broader: Passengers
in scheme: FISH Maritime Cargo Types Thesaurus
issued: 2021-11-19T14:33:00
license: http://creativecommons.org/licenses/by/3.0
attribution URL: http://www.historicengland.org.uk
attribution name: Historic England
publisher: www.historicengland.org.uk
scope note: Personnel serving with one of the three armed forces - army, navy or air force.

Prisoners Of War
type: Concept
broader: Military Personnel
in scheme: FISH Maritime Cargo Types Thesaurus
issued: 2021-11-19T14:33:00
license: http://creativecommons.org/licenses/by/3.0
attribution URL: http://www.historicengland.org.uk
attribution name: Historic England
publisher: www.historicengland.org.uk
scope note: Persons captured in land or naval engagements either being transported to prison out of their native country, sent for exchange, or being returned home.

Tools
type: Concept
broader: Manufactured Goods
narrower: Agricultural Implements
in scheme: FISH Maritime Cargo Types Thesaurus
issued: 2021-11-19T14:33:00
license: http://creativecommons.org/licenses/by/3.0
attribution URL: http://www.historicengland.org.uk
attribution name: Historic England
publisher: www.historicengland.org.uk
scope note: Manufactured objects and devices used to apply a force to an object or perform a particular mechanical function.

Agricultural Implements
type: Concept
broader: Tools
in scheme: FISH Maritime Cargo Types Thesaurus
issued: 2021-11-19T14:33:00
license: http://creativecommons.org/licenses/by/3.0
attribution URL: http://www.historicengland.org.uk
attribution name: Historic England
publisher: www.historicengland.org.uk
scope note: Tools and equipment used for agricultural purposes.

Bombs
type: Concept
broader: Explosives
in scheme: FISH Maritime Cargo Types Thesaurus
issued: 2021-11-19T14:33:00
license: http://creativecommons.org/licenses/by/3.0
attribution URL: http://www.historicengland.org.uk
attribution name: Historic England
publisher: www.historicengland.org.uk
scope note: Containers filled with high explosive, which can be fired from artillery pieces, thrown, dropped by aircraft or placed by hand and detonated in various ways.

Explosives
type: Concept
narrower: Bombs
narrower: Torpedoes
narrower: Dynamite
narrower: Mines
narrower: Gunpowder
broader: Munitions
in scheme: FISH Maritime Cargo Types Thesaurus
issued: 2021-11-19T14:33:00
license: http://creativecommons.org/licenses/by/3.0
attribution URL: http://www.historicengland.org.uk
attribution name: Historic England
publisher: www.historicengland.org.uk
scope note: Manufactured goods, including shells, dynamite etc., containing substances which can be made to explode.

Torpedoes
type: Concept
broader: Explosives
in scheme: FISH Maritime Cargo Types Thesaurus
issued: 2021-11-19T14:33:00
license: http://creativecommons.org/licenses/by/3.0
attribution URL: http://www.historicengland.org.uk
attribution name: Historic England
publisher: www.historicengland.org.uk
scope note: Cylindrical, self-propelled missiles which travel underwater and explode on impact.

Dynamite
type: Concept
broader: Explosives
in scheme: FISH Maritime Cargo Types Thesaurus
issued: 2021-11-19T14:33:00
license: http://creativecommons.org/licenses/by/3.0
attribution URL: http://www.historicengland.org.uk
attribution name: Historic England
publisher: www.historicengland.org.uk
scope note: A high explosive, manufactured by absorbing unstable nitroglycerine in a material such as kieselguhr, a soft, earthy material.

Mines
type: Concept
broader: Explosives
in scheme: FISH Maritime Cargo Types Thesaurus
issued: 2021-11-19T14:33:00
license: http://creativecommons.org/licenses/by/3.0
attribution URL: http://www.historicengland.org.uk
attribution name: Historic England
publisher: www.historicengland.org.uk
scope note: Explosive devices, usually of metal, placed in the ground or floating in water with the purpose of endangering enemy personnel or shipping.

Gunpowder
type: Concept
broader: Explosives
in scheme: FISH Maritime Cargo Types Thesaurus
issued: 2021-11-19T14:33:00
license: http://creativecommons.org/licenses/by/3.0
attribution URL: http://www.historicengland.org.uk
attribution name: Historic England
publisher: www.historicengland.org.uk
scope note: A powder made from charcoal, sulphur and potassium nitrate and used as an explosive in fireworks, flintlock guns etc.

Bones
type: Concept
narrower: Charcoal
narrower: Bone Meal
narrower: Bone Ash
broader: Animal Products
in scheme: FISH Maritime Cargo Types Thesaurus
issued: 2021-11-19T14:33:00
license: http://creativecommons.org/licenses/by/3.0
attribution URL: http://www.historicengland.org.uk
attribution name: Historic England
publisher: www.historicengland.org.uk
related: Antlers
scope note: The hard material, consisting mainly of calcium compounds, which makes up the skeleton of vertebrates. Used for ornaments or ground for use in the manufacture of bone china.

Bone Ash
type: Concept
broader: Bones
in scheme: FISH Maritime Cargo Types Thesaurus
issued: 2021-11-19T14:33:00
license: http://creativecommons.org/licenses/by/3.0
attribution URL: http://www.historicengland.org.uk
attribution name: Historic England
publisher: www.historicengland.org.uk
scope note: The powdery residue of burnt bones.

China Clay
type: Concept
broader: Clay
in scheme: FISH Maritime Cargo Types Thesaurus
issued: 2021-11-19T14:33:00
license: http://creativecommons.org/licenses/by/3.0
attribution URL: http://www.historicengland.org.uk
attribution name: Historic England
publisher: www.historicengland.org.uk
scope note: Clay used in the manufacture of fine ceramics especially porcelain.

Clay
type: Concept
narrower: China Clay
narrower: Fire Clay
narrower: Pipe Clay
broader: Minerals
in scheme: FISH Maritime Cargo Types Thesaurus
issued: 2021-11-19T14:33:00
license: http://creativecommons.org/licenses/by/3.0
attribution URL: http://www.historicengland.org.uk
attribution name: Historic England
publisher: www.historicengland.org.uk
scope note: Fine grained earth which becomes more plastic when water is added. Mainly used in the manufacture of bricks, pottery and other ceramics.

Fire Clay
type: Concept
broader: Clay
in scheme: FISH Maritime Cargo Types Thesaurus
issued: 2021-11-19T14:33:00
license: http://creativecommons.org/licenses/by/3.0
attribution URL: http://www.historicengland.org.uk
attribution name: Historic England
publisher: www.historicengland.org.uk
scope note: Clay used in the manufacture of fire bricks.

Pipe Clay
type: Concept
broader: Clay
in scheme: FISH Maritime Cargo Types Thesaurus
issued: 2021-11-19T14:33:00
license: http://creativecommons.org/licenses/by/3.0
attribution URL: http://www.historicengland.org.uk
attribution name: Historic England
publisher: www.historicengland.org.uk
scope note: A fine white clay used specifically for the manufacture of clay tobacco pipes and for whitening leather.

Claret
type: Concept
broader: Wine
in scheme: FISH Maritime Cargo Types Thesaurus
issued: 2021-11-19T14:33:00
license: http://creativecommons.org/licenses/by/3.0
attribution URL: http://www.historicengland.org.uk
attribution name: Historic England
publisher: www.historicengland.org.uk
scope note: A type of Red Wine from Bordeaux in France.

Wine
type: Concept
narrower: Claret
narrower: Madeira
narrower: Sturne
narrower: Port Wine
narrower: Champagne
broader: Alcoholic Drink
in scheme: FISH Maritime Cargo Types Thesaurus
issued: 2021-11-19T14:33:00
license: http://creativecommons.org/licenses/by/3.0
attribution URL: http://www.historicengland.org.uk
attribution name: Historic England
publisher: www.historicengland.org.uk
scope note: An alcoholic drink made from fermented grape juice (or occasionally other fruits).

Madeira
type: Concept
broader: Wine
in scheme: FISH Maritime Cargo Types Thesaurus
issued: 2021-11-19T14:33:00
license: http://creativecommons.org/licenses/by/3.0
attribution URL: http://www.historicengland.org.uk
attribution name: Historic England
publisher: www.historicengland.org.uk
scope note: Fortified wine produced on the island of Madeira.

Sturne
type: Concept
broader: Wine
in scheme: FISH Maritime Cargo Types Thesaurus
issued: 2021-11-19T14:33:00
license: http://creativecommons.org/licenses/by/3.0
attribution URL: http://www.historicengland.org.uk
attribution name: Historic England
publisher: www.historicengland.org.uk
scope note: Unfermented wine.

Port Wine
type: Concept
broader: Wine
in scheme: FISH Maritime Cargo Types Thesaurus
issued: 2021-11-19T14:33:00
license: http://creativecommons.org/licenses/by/3.0
attribution URL: http://www.historicengland.org.uk
attribution name: Historic England
publisher: www.historicengland.org.uk
scope note: A strong, sweet fortified wine made in Portugal.

Champagne
type: Concept
broader: Wine
in scheme: FISH Maritime Cargo Types Thesaurus
issued: 2021-11-19T14:33:00
license: http://creativecommons.org/licenses/by/3.0
attribution URL: http://www.historicengland.org.uk
attribution name: Historic England
publisher: www.historicengland.org.uk
scope note: A sparkling, white wine traditionally from the Champagne region of France. Now used, loosely, to refer to any sparkling white wine.

Sand
type: Concept
broader: Stone
narrower: Olivine Sand
in scheme: FISH Maritime Cargo Types Thesaurus
issued: 2021-11-19T14:33:00
license: http://creativecommons.org/licenses/by/3.0
attribution URL: http://www.historicengland.org.uk
attribution name: Historic England
publisher: www.historicengland.org.uk
scope note: A material in a granular form that is smaller than gravel and created by the erosion of rocks.

Olivine Sand
type: Concept
broader: Sand
in scheme: FISH Maritime Cargo Types Thesaurus
issued: 2021-11-19T14:33:00
license: http://creativecommons.org/licenses/by/3.0
attribution URL: http://www.historicengland.org.uk
attribution name: Historic England
publisher: www.historicengland.org.uk
scope note: Sand consisting of a mineral common in igneous rocks.

Gemstones
type: Concept
broader: Minerals
in scheme: FISH Maritime Cargo Types Thesaurus
issued: 2021-11-19T14:33:00
license: http://creativecommons.org/licenses/by/3.0
attribution URL: http://www.historicengland.org.uk
attribution name: Historic England
publisher: www.historicengland.org.uk
related: Jewellery
scope note: Cut or uncut stones, usually intended to be set into jewellery, and including precious gems, e.g. diamonds, sapphires, or semi-precious materials, e.g. quartz, agate, amber.

Woad
type: Concept
broader: Plant Products
broader: Pigment
in scheme: FISH Maritime Cargo Types Thesaurus
issued: 2021-11-19T14:33:00
license: http://creativecommons.org/licenses/by/3.0
attribution URL: http://www.historicengland.org.uk
attribution name: Historic England
publisher: www.historicengland.org.uk
scope note: The blue dyestuff prepared from the leaves of the plant Isatis tinctoria, and sometimes used to discribe the plant itself. Later superseded by indigo.

Resin
type: Concept
broader: Oil Based Products
narrower: Rosin
in scheme: FISH Maritime Cargo Types Thesaurus
issued: 2021-11-19T14:33:00
license: http://creativecommons.org/licenses/by/3.0
attribution URL: http://www.historicengland.org.uk
attribution name: Historic England
publisher: www.historicengland.org.uk
scope note: Hydrocarbon secretion of a tree or bush, either naturally exuded or deliberately tapped from the tree, valued for its varied uses in chemicals and perfumery.

Rosin
type: Concept
broader: Resin
in scheme: FISH Maritime Cargo Types Thesaurus
issued: 2021-11-19T14:33:00
license: http://creativecommons.org/licenses/by/3.0
attribution URL: http://www.historicengland.org.uk
attribution name: Historic England
publisher: www.historicengland.org.uk
scope note: An amber like substance derived from pine or turpentine.

Dress Accessories
type: Concept
broader: Manufactured Goods
in scheme: FISH Maritime Cargo Types Thesaurus
issued: 2021-11-19T14:33:00
license: http://creativecommons.org/licenses/by/3.0
attribution URL: http://www.historicengland.org.uk
attribution name: Historic England
publisher: www.historicengland.org.uk
related: Jewellery
scope note: Items worn or carried as an adjunct to clothing, for example, headdresses, sashes, fans, masks etc.

Tank Components
type: Concept
broader: Tanks
in scheme: FISH Maritime Cargo Types Thesaurus
issued: 2021-11-19T14:33:00
license: http://creativecommons.org/licenses/by/3.0
attribution URL: http://www.historicengland.org.uk
attribution name: Historic England
publisher: www.historicengland.org.uk
scope note: Machinery and parts for the manufacture or assembly of military tanks, i.e. armoured vehicles.

Tanks
type: Concept
narrower: Tank Components
broader: Military Vehicles
in scheme: FISH Maritime Cargo Types Thesaurus
issued: 2021-11-19T14:33:00
license: http://creativecommons.org/licenses/by/3.0
attribution URL: http://www.historicengland.org.uk
attribution name: Historic England
publisher: www.historicengland.org.uk
scope note: Tracked, armoured fighting vehicles designed for front-line combat.

Sewing Machines
type: Concept
broader: Machinery
in scheme: FISH Maritime Cargo Types Thesaurus
issued: 2021-11-19T14:33:00
license: http://creativecommons.org/licenses/by/3.0
attribution URL: http://www.historicengland.org.uk
attribution name: Historic England
publisher: www.historicengland.org.uk
scope note: Machines for mechanical sewing, as opposed to sewing by hand. Victoriran and early 20th century examples are usually constructed of metal and operated by a hand wheel or treadle. Later examples may be electrically operated and/or have a plastic shell.

Machinery
type: Concept
narrower: Sewing Machines
narrower: Farm Machinery
narrower: Mining Machinery
broader: Manufactured Goods
in scheme: FISH Maritime Cargo Types Thesaurus
issued: 2021-11-19T14:33:00
license: http://creativecommons.org/licenses/by/3.0
attribution URL: http://www.historicengland.org.uk
attribution name: Historic England
publisher: www.historicengland.org.uk
scope note: Apparatus used for applying a mechanical force, or to perform a particular function. Use more specific type where known.

Farm Machinery
type: Concept
broader: Machinery
in scheme: FISH Maritime Cargo Types Thesaurus
issued: 2021-11-19T14:33:00
license: http://creativecommons.org/licenses/by/3.0
attribution URL: http://www.historicengland.org.uk
attribution name: Historic England
publisher: www.historicengland.org.uk
scope note: Machinery including tractors, ploughs, harrows etc, which are used on farms.

Mining Machinery
type: Concept
broader: Machinery
in scheme: FISH Maritime Cargo Types Thesaurus
issued: 2021-11-19T14:33:00
license: http://creativecommons.org/licenses/by/3.0
attribution URL: http://www.historicengland.org.uk
attribution name: Historic England
publisher: www.historicengland.org.uk
scope note: Machinery, e.g. drive wheels, used in powering and excavating mines, i.e. mines for the extraction of minerals such as coal, lead or tin.

Nitrate
type: Concept
broader: Fertilizer
narrower: Ammonium Nitrate
in scheme: FISH Maritime Cargo Types Thesaurus
issued: 2021-11-19T14:33:00
license: http://creativecommons.org/licenses/by/3.0
attribution URL: http://www.historicengland.org.uk
attribution name: Historic England
publisher: www.historicengland.org.uk
scope note: A fertilizer containing nitrogen.

Ammonium Nitrate
type: Concept
broader: Nitrate
in scheme: FISH Maritime Cargo Types Thesaurus
issued: 2021-11-19T14:33:00
license: http://creativecommons.org/licenses/by/3.0
attribution URL: http://www.historicengland.org.uk
attribution name: Historic England
publisher: www.historicengland.org.uk
scope note: A fertilizer derived from nitrogen; also known as nitrate of ammonia.

Copper
type: Concept
broader: Metal
narrower: Copper Ingots
in scheme: FISH Maritime Cargo Types Thesaurus
issued: 2021-11-19T14:33:00
license: http://creativecommons.org/licenses/by/3.0
attribution URL: http://www.historicengland.org.uk
attribution name: Historic England
publisher: www.historicengland.org.uk
scope note: A reddish metal used in alloys, coins and the construction and electronics industries.

Copper Ingots
type: Concept
broader: Copper
in scheme: FISH Maritime Cargo Types Thesaurus
issued: 2021-11-19T14:33:00
license: http://creativecommons.org/licenses/by/3.0
attribution URL: http://www.historicengland.org.uk
attribution name: Historic England
publisher: www.historicengland.org.uk
scope note: Solid bars made from pure Copper metal.

Horses
type: Concept
broader: Animals
in scheme: FISH Maritime Cargo Types Thesaurus
issued: 2021-11-19T14:33:00
license: http://creativecommons.org/licenses/by/3.0
attribution URL: http://www.historicengland.org.uk
attribution name: Historic England
publisher: www.historicengland.org.uk
scope note: Large mammals, domesticated for riding and as draught animals.

Animals
type: Concept
narrower: Horses
narrower: Non Domesticated Animals
narrower: Sheep
narrower: Fish
narrower: Cattle
narrower: Donkeys
narrower: Pigs
narrower: Mules
broader: Animals And Animal Products
in scheme: FISH Maritime Cargo Types Thesaurus
issued: 2021-11-19T14:33:00
license: http://creativecommons.org/licenses/by/3.0
attribution URL: http://www.historicengland.org.uk
attribution name: Historic England
publisher: www.historicengland.org.uk
scope note: Use for cargoes of live animals only.

Non Domesticated Animals
type: Concept
broader: Animals
in scheme: FISH Maritime Cargo Types Thesaurus
issued: 2021-11-19T14:33:00
license: http://creativecommons.org/licenses/by/3.0
attribution URL: http://www.historicengland.org.uk
attribution name: Historic England
publisher: www.historicengland.org.uk
scope note: Any animal other than livestock (animals carried as food); animals used for transport (horses; mules); and domestic pets. Such animals may be exported as specimens, for zoos, menageries, and circuses, or as unusual pets (e.g. elephants, monkeys).

Cattle
type: Concept
broader: Animals
in scheme: FISH Maritime Cargo Types Thesaurus
issued: 2021-11-19T14:33:00
license: http://creativecommons.org/licenses/by/3.0
attribution URL: http://www.historicengland.org.uk
attribution name: Historic England
publisher: www.historicengland.org.uk
scope note: Large mammals of the genus Bos, domesticated to provide milk, beef and materials eg. leather. Use only for live animals.

Donkeys
type: Concept
broader: Animals
in scheme: FISH Maritime Cargo Types Thesaurus
issued: 2021-11-19T14:33:00
license: http://creativecommons.org/licenses/by/3.0
attribution URL: http://www.historicengland.org.uk
attribution name: Historic England
publisher: www.historicengland.org.uk
scope note: Equine mammal used primarily as a beast of burden.

Pigs
type: Concept
broader: Animals
in scheme: FISH Maritime Cargo Types Thesaurus
issued: 2021-11-19T14:33:00
license: http://creativecommons.org/licenses/by/3.0
attribution URL: http://www.historicengland.org.uk
attribution name: Historic England
publisher: www.historicengland.org.uk
scope note: Domesticated animals, derived from the wild boar, kept as a source of ham, bacon and pork products.

Mules
type: Concept
broader: Animals
in scheme: FISH Maritime Cargo Types Thesaurus
issued: 2021-11-19T14:33:00
license: http://creativecommons.org/licenses/by/3.0
attribution URL: http://www.historicengland.org.uk
attribution name: Historic England
publisher: www.historicengland.org.uk
scope note: Draught animals produced by mating asses and horses.

Bullion
type: Concept
narrower: Silver Bullion
broader: Bullion And Coin
in scheme: FISH Maritime Cargo Types Thesaurus
issued: 2021-11-19T14:33:00
license: http://creativecommons.org/licenses/by/3.0
attribution URL: http://www.historicengland.org.uk
attribution name: Historic England
publisher: www.historicengland.org.uk
scope note: Metal, usually gold and silver, in the form of ingots prior to being minted into coinage.

Sulphur Ore
type: Concept
broader: Mineral Ore
in scheme: FISH Maritime Cargo Types Thesaurus
issued: 2021-11-19T14:33:00
license: http://creativecommons.org/licenses/by/3.0
attribution URL: http://www.historicengland.org.uk
attribution name: Historic England
publisher: www.historicengland.org.uk
scope note: Ore containing a high proportion of sulphur.

Mineral Ore
type: Concept
narrower: Sulphur Ore
narrower: Manganese Ore
narrower: Gypsum
broader: Ore
in scheme: FISH Maritime Cargo Types Thesaurus
issued: 2021-11-19T14:33:00
license: http://creativecommons.org/licenses/by/3.0
attribution URL: http://www.historicengland.org.uk
attribution name: Historic England
publisher: www.historicengland.org.uk
scope note: An ore containing sufficient quantities of a mineral as to make its extraction profitable.

Manganese Ore
type: Concept
broader: Mineral Ore
in scheme: FISH Maritime Cargo Types Thesaurus
issued: 2021-11-19T14:33:00
license: http://creativecommons.org/licenses/by/3.0
attribution URL: http://www.historicengland.org.uk
attribution name: Historic England
publisher: www.historicengland.org.uk
scope note: An ore containing a high proportion of manganese.

Gypsum
type: Concept
broader: Mineral Ore
in scheme: FISH Maritime Cargo Types Thesaurus
issued: 2021-11-19T14:33:00
license: http://creativecommons.org/licenses/by/3.0
attribution URL: http://www.historicengland.org.uk
attribution name: Historic England
publisher: www.historicengland.org.uk
scope note: Calcium sulphate used as a fertilizer and for making plaster of Paris.

Culm
type: Concept
broader: Coal Dust
in scheme: FISH Maritime Cargo Types Thesaurus
issued: 2021-11-19T14:33:00
license: http://creativecommons.org/licenses/by/3.0
attribution URL: http://www.historicengland.org.uk
attribution name: Historic England
publisher: www.historicengland.org.uk
scope note: Coal dust or slack, especially that of anthracite.

Coal Dust
type: Concept
narrower: Culm
broader: Coal
in scheme: FISH Maritime Cargo Types Thesaurus
issued: 2021-11-19T14:33:00
license: http://creativecommons.org/licenses/by/3.0
attribution URL: http://www.historicengland.org.uk
attribution name: Historic England
publisher: www.historicengland.org.uk
scope note: Powdered coal.

Liquorice
type: Concept
broader: Food
broader: Plant Products
in scheme: FISH Maritime Cargo Types Thesaurus
issued: 2021-11-19T14:33:00
license: http://creativecommons.org/licenses/by/3.0
attribution URL: http://www.historicengland.org.uk
attribution name: Historic England
publisher: www.historicengland.org.uk
scope note: A preparation made from the evaporated juice of the rhizome of the plant Glycyrrhiza glabra, used medicinally and as a sweet, usually in the form of a black, chewy substance.

Prunes
type: Concept
broader: Dried Fruit
in scheme: FISH Maritime Cargo Types Thesaurus
issued: 2021-11-19T14:33:00
license: http://creativecommons.org/licenses/by/3.0
attribution URL: http://www.historicengland.org.uk
attribution name: Historic England
publisher: www.historicengland.org.uk
scope note: Dried or partially dried plums eaten as fruit.

Dried Fruit
type: Concept
narrower: Prunes
narrower: Raisins
narrower: Currants
broader: Fruit
in scheme: FISH Maritime Cargo Types Thesaurus
issued: 2021-11-19T14:33:00
license: http://creativecommons.org/licenses/by/3.0
attribution URL: http://www.historicengland.org.uk
attribution name: Historic England
publisher: www.historicengland.org.uk
scope note: Fruit which has been preserved by drying.

Raisins
type: Concept
broader: Dried Fruit
in scheme: FISH Maritime Cargo Types Thesaurus
issued: 2021-11-19T14:33:00
license: http://creativecommons.org/licenses/by/3.0
attribution URL: http://www.historicengland.org.uk
attribution name: Historic England
publisher: www.historicengland.org.uk
scope note: Dried or partially dried grapes eaten as a fruit.

Currants
type: Concept
broader: Dried Fruit
in scheme: FISH Maritime Cargo Types Thesaurus
issued: 2021-11-19T14:33:00
license: http://creativecommons.org/licenses/by/3.0
attribution URL: http://www.historicengland.org.uk
attribution name: Historic England
publisher: www.historicengland.org.uk
scope note: Dried seedless grapes used in cookery.

Linseed
type: Concept
broader: Plant Products
narrower: Linseed Oil
narrower: Linseed Cake
in scheme: FISH Maritime Cargo Types Thesaurus
issued: 2021-11-19T14:33:00
license: http://creativecommons.org/licenses/by/3.0
attribution URL: http://www.historicengland.org.uk
attribution name: Historic England
publisher: www.historicengland.org.uk
scope note: The seed of the flax plant used to produce oil and, in LINSEED CAKE, as fodder.

Linseed Oil
type: Concept
broader: Linseed
in scheme: FISH Maritime Cargo Types Thesaurus
issued: 2021-11-19T14:33:00
license: http://creativecommons.org/licenses/by/3.0
attribution URL: http://www.historicengland.org.uk
attribution name: Historic England
publisher: www.historicengland.org.uk
scope note: Oil produced from the seed of the flax plant. Used in the production of paints, varnish etc.

Linseed Cake
type: Concept
broader: Linseed
in scheme: FISH Maritime Cargo Types Thesaurus
issued: 2021-11-19T14:33:00
license: http://creativecommons.org/licenses/by/3.0
attribution URL: http://www.historicengland.org.uk
attribution name: Historic England
publisher: www.historicengland.org.uk
scope note: The seed of the flax plant pressed into cakes and used as cattle fodder.

Cotton Seed
type: Concept
broader: Seed
broader: Cotton
in scheme: FISH Maritime Cargo Types Thesaurus
issued: 2021-11-19T14:33:00
license: http://creativecommons.org/licenses/by/3.0
attribution URL: http://www.historicengland.org.uk
attribution name: Historic England
publisher: www.historicengland.org.uk
scope note: Seed of the cotton plant from which edible oil is extracted.

Seed
type: Concept
narrower: Cotton Seed
broader: Plant Products
in scheme: FISH Maritime Cargo Types Thesaurus
issued: 2021-11-19T14:33:00
license: http://creativecommons.org/licenses/by/3.0
attribution URL: http://www.historicengland.org.uk
attribution name: Historic England
publisher: www.historicengland.org.uk
scope note: The grains of various plants from which new plants grown.

Dairy Produce
type: Concept
broader: Food
narrower: Eggs
narrower: Butter
narrower: Cheese
in scheme: FISH Maritime Cargo Types Thesaurus
issued: 2021-11-19T14:33:00
license: http://creativecommons.org/licenses/by/3.0
attribution URL: http://www.historicengland.org.uk
attribution name: Historic England
publisher: www.historicengland.org.uk
scope note: Products, such as cheese and butter, manufactured from milk.

Eggs
type: Concept
broader: Dairy Produce
in scheme: FISH Maritime Cargo Types Thesaurus
issued: 2021-11-19T14:33:00
license: http://creativecommons.org/licenses/by/3.0
attribution URL: http://www.historicengland.org.uk
attribution name: Historic England
publisher: www.historicengland.org.uk
scope note: A spheroid produced predominantly by birds, though also produced by some animals, which encases the young creature providing a place for it to develop.

Butter
type: Concept
broader: Dairy Produce
in scheme: FISH Maritime Cargo Types Thesaurus
issued: 2021-11-19T14:33:00
license: http://creativecommons.org/licenses/by/3.0
attribution URL: http://www.historicengland.org.uk
attribution name: Historic England
publisher: www.historicengland.org.uk
scope note: Dairy produce obtained by churning cream and used in cookery as a source of fat.

Cheese
type: Concept
broader: Dairy Produce
in scheme: FISH Maritime Cargo Types Thesaurus
issued: 2021-11-19T14:33:00
license: http://creativecommons.org/licenses/by/3.0
attribution URL: http://www.historicengland.org.uk
attribution name: Historic England
publisher: www.historicengland.org.uk
scope note: Dairy produce formed from the curds of milk, coagulated by rennet and pressed into a solid mass.

Roofing Slate
type: Concept
broader: Slate
broader: Stone Products
in scheme: FISH Maritime Cargo Types Thesaurus
issued: 2021-11-19T14:33:00
license: http://creativecommons.org/licenses/by/3.0
attribution URL: http://www.historicengland.org.uk
attribution name: Historic England
publisher: www.historicengland.org.uk
scope note: Thin plates of slate, usually rectangular in shape, used as roofing tiles.

Slate
type: Concept
narrower: Roofing Slate
broader: Stone
in scheme: FISH Maritime Cargo Types Thesaurus
issued: 2021-11-19T14:33:00
license: http://creativecommons.org/licenses/by/3.0
attribution URL: http://www.historicengland.org.uk
attribution name: Historic England
publisher: www.historicengland.org.uk
scope note: A fine grained rock which splits easily into plates. Used for the manufacture of roofing tiles etc.

Uniforms
type: Concept
broader: Military Equipment
broader: Clothing
in scheme: FISH Maritime Cargo Types Thesaurus
issued: 2021-11-19T14:33:00
license: http://creativecommons.org/licenses/by/3.0
attribution URL: http://www.historicengland.org.uk
attribution name: Historic England
publisher: www.historicengland.org.uk
scope note: Clothes which are distinctive in cut, colour and fabric and worn by members of the armed forces, emergency services or civilian organizations to help to distinguish their members form other organizations.

Soil
type: Concept
broader: Fertilizer And Waste
narrower: Fullers Earth
in scheme: FISH Maritime Cargo Types Thesaurus
issued: 2021-11-19T14:33:00
license: http://creativecommons.org/licenses/by/3.0
attribution URL: http://www.historicengland.org.uk
attribution name: Historic England
publisher: www.historicengland.org.uk
scope note: The top layer of earth consisting of humus and rock particles.

Animals And Animal Products
type: Concept
broader: Cargo
narrower: Animals
narrower: Animal Products
in scheme: FISH Maritime Cargo Types Thesaurus
issued: 2021-11-19T14:33:00
license: http://creativecommons.org/licenses/by/3.0
attribution URL: http://www.historicengland.org.uk
attribution name: Historic England
publisher: www.historicengland.org.uk
scope note: Animals and products made from the carcasses and hides of dead animals.

Pimentos
type: Concept
broader: Peppers
in scheme: FISH Maritime Cargo Types Thesaurus
issued: 2021-11-19T14:33:00
license: http://creativecommons.org/licenses/by/3.0
attribution URL: http://www.historicengland.org.uk
attribution name: Historic England
publisher: www.historicengland.org.uk
scope note: Sweet red peppers.

Peppers
type: Concept
narrower: Pimentos
broader: Vegetables
in scheme: FISH Maritime Cargo Types Thesaurus
issued: 2021-11-19T14:33:00
license: http://creativecommons.org/licenses/by/3.0
attribution URL: http://www.historicengland.org.uk
attribution name: Historic England
publisher: www.historicengland.org.uk
scope note: The fruit of certain varieties of the plant Capsicum Annum eaten as vegetables.

Navigational Instruments
type: Concept
broader: Manufactured Goods
in scheme: FISH Maritime Cargo Types Thesaurus
issued: 2021-11-19T14:33:00
license: http://creativecommons.org/licenses/by/3.0
attribution URL: http://www.historicengland.org.uk
attribution name: Historic England
publisher: www.historicengland.org.uk
related: Telescopes
scope note: Instruments for determining position at sea, e.g. compasses, sextants.

Lambs
type: Concept
broader: Sheep
in scheme: FISH Maritime Cargo Types Thesaurus
issued: 2021-11-19T14:33:00
license: http://creativecommons.org/licenses/by/3.0
attribution URL: http://www.historicengland.org.uk
attribution name: Historic England
publisher: www.historicengland.org.uk
scope note: The young of the sheep.

Sheep
type: Concept
narrower: Lambs
broader: Animals
in scheme: FISH Maritime Cargo Types Thesaurus
issued: 2021-11-19T14:33:00
license: http://creativecommons.org/licenses/by/3.0
attribution URL: http://www.historicengland.org.uk
attribution name: Historic England
publisher: www.historicengland.org.uk
related: Wool
scope note: Medium-sized animals domesticated for their wool, skin, meat and milk.

Pianos
type: Concept
broader: Musical Instruments
in scheme: FISH Maritime Cargo Types Thesaurus
issued: 2021-11-19T14:33:00
license: http://creativecommons.org/licenses/by/3.0
attribution URL: http://www.historicengland.org.uk
attribution name: Historic England
publisher: www.historicengland.org.uk
scope note: Large keyboard, percussion instruments in which strings are struck by hammers to produce notes.

Musical Instruments
type: Concept
narrower: Pianos
narrower: Hand Bells
broader: Manufactured Goods
in scheme: FISH Maritime Cargo Types Thesaurus
issued: 2021-11-19T14:33:00
license: http://creativecommons.org/licenses/by/3.0
attribution URL: http://www.historicengland.org.uk
attribution name: Historic England
publisher: www.historicengland.org.uk
scope note: Use for unspecified musical instruments.

Paraffin
type: Concept
broader: Fuel
broader: Oil Based Products
in scheme: FISH Maritime Cargo Types Thesaurus
issued: 2021-11-19T14:33:00
license: http://creativecommons.org/licenses/by/3.0
attribution URL: http://www.historicengland.org.uk
attribution name: Historic England
publisher: www.historicengland.org.uk
scope note: A solid material which is combustible distilled from petroleum.

Beaver Furs
type: Concept
broader: Furs
in scheme: FISH Maritime Cargo Types Thesaurus
issued: 2021-11-19T14:33:00
license: http://creativecommons.org/licenses/by/3.0
attribution URL: http://www.historicengland.org.uk
attribution name: Historic England
publisher: www.historicengland.org.uk
scope note: The pelts of beavers used for the manufacture of fur coats and hats.

Furs
type: Concept
narrower: Beaver Furs
broader: Animal Skins
in scheme: FISH Maritime Cargo Types Thesaurus
issued: 2021-11-19T14:33:00
license: http://creativecommons.org/licenses/by/3.0
attribution URL: http://www.historicengland.org.uk
attribution name: Historic England
publisher: www.historicengland.org.uk
scope note: Animal skins which have the outer pelt of fur on them.

Alumina
type: Concept
broader: Aluminium
in scheme: FISH Maritime Cargo Types Thesaurus
issued: 2021-11-19T14:33:00
license: http://creativecommons.org/licenses/by/3.0
attribution URL: http://www.historicengland.org.uk
attribution name: Historic England
publisher: www.historicengland.org.uk
scope note: Aluminium oxide.

Aluminium
type: Concept
narrower: Alumina
narrower: Alum
broader: Metal
in scheme: FISH Maritime Cargo Types Thesaurus
issued: 2021-11-19T14:33:00
license: http://creativecommons.org/licenses/by/3.0
attribution URL: http://www.historicengland.org.uk
attribution name: Historic England
publisher: www.historicengland.org.uk
scope note: A light, ductile metal, used in the manufacture of aircraft etc.

Alum
type: Concept
broader: Aluminium
in scheme: FISH Maritime Cargo Types Thesaurus
issued: 2021-11-19T14:33:00
license: http://creativecommons.org/licenses/by/3.0
attribution URL: http://www.historicengland.org.uk
attribution name: Historic England
publisher: www.historicengland.org.uk
scope note: A sulphate of aluminium and potassium used in the dyeing process as a mordant to increase the intake of dye into a cloth.

Gold
type: Concept
broader: Metal
narrower: Gold Dust
in scheme: FISH Maritime Cargo Types Thesaurus
issued: 2021-11-19T14:33:00
license: http://creativecommons.org/licenses/by/3.0
attribution URL: http://www.historicengland.org.uk
attribution name: Historic England
publisher: www.historicengland.org.uk
scope note: A yellowish, tarnish-resistant precious metal used to make jewellery and coins.

Gold Dust
type: Concept
broader: Gold
in scheme: FISH Maritime Cargo Types Thesaurus
issued: 2021-11-19T14:33:00
license: http://creativecommons.org/licenses/by/3.0
attribution URL: http://www.historicengland.org.uk
attribution name: Historic England
publisher: www.historicengland.org.uk
scope note: Very fine particles of gold.

Mail
type: Concept
broader: Cargo
narrower: Dispatches
in scheme: FISH Maritime Cargo Types Thesaurus
issued: 2021-11-19T14:33:00
license: http://creativecommons.org/licenses/by/3.0
attribution URL: http://www.historicengland.org.uk
attribution name: Historic England
publisher: www.historicengland.org.uk
scope note: Letters and parcels transported on behalf of the dispatchers by the postal services.

Dispatches
type: Concept
broader: Mail
in scheme: FISH Maritime Cargo Types Thesaurus
issued: 2021-11-19T14:33:00
license: http://creativecommons.org/licenses/by/3.0
attribution URL: http://www.historicengland.org.uk
attribution name: Historic England
publisher: www.historicengland.org.uk
scope note: Written communiques, often of a military or governmental nature, requiring fast delivery.

Tin Plate
type: Concept
broader: Tin
in scheme: FISH Maritime Cargo Types Thesaurus
issued: 2021-11-19T14:33:00
license: http://creativecommons.org/licenses/by/3.0
attribution URL: http://www.historicengland.org.uk
attribution name: Historic England
publisher: www.historicengland.org.uk
scope note: Sheets of iron or steel coated with tin.

Tin
type: Concept
narrower: Tin Plate
narrower: Tin Ingots
broader: Metal
in scheme: FISH Maritime Cargo Types Thesaurus
issued: 2021-11-19T14:33:00
license: http://creativecommons.org/licenses/by/3.0
attribution URL: http://www.historicengland.org.uk
attribution name: Historic England
publisher: www.historicengland.org.uk
scope note: A lustrous, malleable metal, which is resistant to corrosion. Tin is used in alloys such as pewter and used in the manufacture of cans for the storage of food.

Tin Ingots
type: Concept
broader: Tin
in scheme: FISH Maritime Cargo Types Thesaurus
issued: 2021-11-19T14:33:00
license: http://creativecommons.org/licenses/by/3.0
attribution URL: http://www.historicengland.org.uk
attribution name: Historic England
publisher: www.historicengland.org.uk
scope note: Solid bars made from pure tin.

Candlesticks
type: Concept
broader: Household Goods
in scheme: FISH Maritime Cargo Types Thesaurus
issued: 2021-11-19T14:33:00
license: http://creativecommons.org/licenses/by/3.0
attribution URL: http://www.historicengland.org.uk
attribution name: Historic England
publisher: www.historicengland.org.uk
related: Candles
scope note: Holders for one or more candles, usually of metal or pewter.

Madder
type: Concept
broader: Plants
in scheme: FISH Maritime Cargo Types Thesaurus
issued: 2021-11-19T14:33:00
license: http://creativecommons.org/licenses/by/3.0
attribution URL: http://www.historicengland.org.uk
attribution name: Historic England
publisher: www.historicengland.org.uk
scope note: A climbing plant (Rubia tinctorum) which was formerly cultivated for the reddish-purple dye obtained from the roots.

Plants
type: Concept
narrower: Madder
narrower: Kelp
narrower: Barilla
broader: Plants And Plant Products
in scheme: FISH Maritime Cargo Types Thesaurus
issued: 2021-11-19T14:33:00
license: http://creativecommons.org/licenses/by/3.0
attribution URL: http://www.historicengland.org.uk
attribution name: Historic England
publisher: www.historicengland.org.uk
scope note: A living thing that is not an animal. Use for unspecified plants only. Use a more specific type where known.

Kelp
type: Concept
broader: Plants
in scheme: FISH Maritime Cargo Types Thesaurus
issued: 2021-11-19T14:33:00
license: http://creativecommons.org/licenses/by/3.0
attribution URL: http://www.historicengland.org.uk
attribution name: Historic England
publisher: www.historicengland.org.uk
scope note: Various seaweeds which are burnt to obtain the salts contained in their ashes, which are used in the manufacture of soap and glass.

Barilla
type: Concept
broader: Plants
in scheme: FISH Maritime Cargo Types Thesaurus
issued: 2021-11-19T14:33:00
license: http://creativecommons.org/licenses/by/3.0
attribution URL: http://www.historicengland.org.uk
attribution name: Historic England
publisher: www.historicengland.org.uk
scope note: A plant, Salsola soda, burnt to produce alkali.

Cutlery
type: Concept
broader: Tableware
in scheme: FISH Maritime Cargo Types Thesaurus
issued: 2021-11-19T14:33:00
license: http://creativecommons.org/licenses/by/3.0
attribution URL: http://www.historicengland.org.uk
attribution name: Historic England
publisher: www.historicengland.org.uk
scope note: Metal knives, forks and spoons, carried either as an export cargo or for crew and/or passengers.

Tableware
type: Concept
narrower: Cutlery
narrower: Crockery
broader: Household Goods
in scheme: FISH Maritime Cargo Types Thesaurus
issued: 2021-11-19T14:33:00
license: http://creativecommons.org/licenses/by/3.0
attribution URL: http://www.historicengland.org.uk
attribution name: Historic England
publisher: www.historicengland.org.uk
scope note: Items of crockery and cutlery which are used whilst dining, either to eat with or for table decoration.

Crockery
type: Concept
broader: Tableware
narrower: China Tableware
in scheme: FISH Maritime Cargo Types Thesaurus
issued: 2021-11-19T14:33:00
license: http://creativecommons.org/licenses/by/3.0
attribution URL: http://www.historicengland.org.uk
attribution name: Historic England
publisher: www.historicengland.org.uk
scope note: Tableware manufactured from any kind of ceramic and either carried as an export cargo or for the benefit of crew and/or passengers on board ship.

China Tableware
type: Concept
broader: Crockery
in scheme: FISH Maritime Cargo Types Thesaurus
issued: 2021-11-19T14:33:00
license: http://creativecommons.org/licenses/by/3.0
attribution URL: http://www.historicengland.org.uk
attribution name: Historic England
publisher: www.historicengland.org.uk
scope note: Tabelware manufactured from china clay.

Watches
type: Concept
broader: Manufactured Goods
in scheme: FISH Maritime Cargo Types Thesaurus
issued: 2021-11-19T14:33:00
license: http://creativecommons.org/licenses/by/3.0
attribution URL: http://www.historicengland.org.uk
attribution name: Historic England
publisher: www.historicengland.org.uk
related: Jewellery
scope note: Personal apparatus for telling the time, worn either as jewellery or purely functional in nature, usually on the wrist or as a suspended fob.

Sculpture
type: Concept
broader: Ornaments
in scheme: FISH Maritime Cargo Types Thesaurus
issued: 2021-11-19T14:33:00
license: http://creativecommons.org/licenses/by/3.0
attribution URL: http://www.historicengland.org.uk
attribution name: Historic England
publisher: www.historicengland.org.uk
scope note: Three-dimensional artwork usually created out of stone, e.g. marble; metal, e.g. bronze; ceramics, e.g. terracotta, or other suitable materials.

Ornaments
type: Concept
narrower: Sculpture
broader: Manufactured Goods
in scheme: FISH Maritime Cargo Types Thesaurus
issued: 2021-11-19T14:33:00
license: http://creativecommons.org/licenses/by/3.0
attribution URL: http://www.historicengland.org.uk
attribution name: Historic England
publisher: www.historicengland.org.uk
scope note: Any unspecified items without utility or function and prized for personal or domestic decorative value. Examples might be unspecified metal objects from the Bronze Age or Victorian Staffordshire china dogs.

Hand Bells
type: Concept
broader: Manufactured Goods
broader: Musical Instruments
in scheme: FISH Maritime Cargo Types Thesaurus
issued: 2021-11-19T14:33:00
license: http://creativecommons.org/licenses/by/3.0
attribution URL: http://www.historicengland.org.uk
attribution name: Historic England
publisher: www.historicengland.org.uk
scope note: Bells used either as a percussion instrument or for other purposes such as calling attention, marking time periods etc.

Antlers
type: Concept
broader: Animal Products
in scheme: FISH Maritime Cargo Types Thesaurus
issued: 2021-11-19T14:33:00
license: http://creativecommons.org/licenses/by/3.0
attribution URL: http://www.historicengland.org.uk
attribution name: Historic England
publisher: www.historicengland.org.uk
related: Bones
scope note: Bone like material which grows in a branch-like fashion on the heads of male deer and reindeers in general.

Aircraft Components
type: Concept
broader: Aircraft
in scheme: FISH Maritime Cargo Types Thesaurus
issued: 2021-11-19T14:33:00
license: http://creativecommons.org/licenses/by/3.0
attribution URL: http://www.historicengland.org.uk
attribution name: Historic England
publisher: www.historicengland.org.uk
scope note: Machinery and equipment used in the manufacture of aircraft.

Aircraft
type: Concept
narrower: Aircraft Components
broader: Vehicles
in scheme: FISH Maritime Cargo Types Thesaurus
issued: 2021-11-19T14:33:00
license: http://creativecommons.org/licenses/by/3.0
attribution URL: http://www.historicengland.org.uk
attribution name: Historic England
publisher: www.historicengland.org.uk
scope note: Aircraft as cargo carried whole or crated ready for assembly on arrival at the destination port. Do not use where the vessel is an aircraft carrier and the aircraft is carried as part of the vessel's armament.

Dyewood
type: Concept
narrower: Logwood
broader: Timber Products
in scheme: FISH Maritime Cargo Types Thesaurus
issued: 2021-11-19T14:33:00
license: http://creativecommons.org/licenses/by/3.0
attribution URL: http://www.historicengland.org.uk
attribution name: Historic England
publisher: www.historicengland.org.uk
scope note: Wood used to produce a dye.

Acid
type: Concept
broader: Chemicals
narrower: Sulphuric Acid
in scheme: FISH Maritime Cargo Types Thesaurus
issued: 2021-11-19T14:33:00
license: http://creativecommons.org/licenses/by/3.0
attribution URL: http://www.historicengland.org.uk
attribution name: Historic England
publisher: www.historicengland.org.uk
scope note: Corrosive chemical compounds, usually liquids, which are neutralized by alkalis.

Rock Salt
type: Concept
broader: Salt
in scheme: FISH Maritime Cargo Types Thesaurus
issued: 2021-11-19T14:33:00
license: http://creativecommons.org/licenses/by/3.0
attribution URL: http://www.historicengland.org.uk
attribution name: Historic England
publisher: www.historicengland.org.uk
scope note: Salt in its natural state

Salt
type: Concept
narrower: Rock Salt
broader: Seasonings
in scheme: FISH Maritime Cargo Types Thesaurus
issued: 2021-11-19T14:33:00
license: http://creativecommons.org/licenses/by/3.0
attribution URL: http://www.historicengland.org.uk
attribution name: Historic England
publisher: www.historicengland.org.uk
scope note: A mineral, Sodium Chloride, obtained by mining or the evaporation of brine used as a seasoning and for preserving food.

Oil Cake
type: Concept
broader: Cattle Fodder
in scheme: FISH Maritime Cargo Types Thesaurus
issued: 2021-11-19T14:33:00
license: http://creativecommons.org/licenses/by/3.0
attribution URL: http://www.historicengland.org.uk
attribution name: Historic England
publisher: www.historicengland.org.uk
scope note: Cattle fodder or fertilizer resulting from the extracting of oil from seeds.

Cattle Fodder
type: Concept
narrower: Oil Cake
broader: Animal Fodder
in scheme: FISH Maritime Cargo Types Thesaurus
issued: 2021-11-19T14:33:00
license: http://creativecommons.org/licenses/by/3.0
attribution URL: http://www.historicengland.org.uk
attribution name: Historic England
publisher: www.historicengland.org.uk
scope note: Dried produce especially, hay, straw etc. used to feed cattle.

Seasonings
type: Concept
broader: Spices And Seasonings
narrower: Pepper
narrower: Salt
narrower: Saffron
in scheme: FISH Maritime Cargo Types Thesaurus
issued: 2021-11-19T14:33:00
license: http://creativecommons.org/licenses/by/3.0
attribution URL: http://www.historicengland.org.uk
attribution name: Historic England
publisher: www.historicengland.org.uk
scope note: Savoury ingredients, such as herbs, used to add flavour to food.

Pepper
type: Concept
broader: Seasonings
in scheme: FISH Maritime Cargo Types Thesaurus
issued: 2021-11-19T14:33:00
license: http://creativecommons.org/licenses/by/3.0
attribution URL: http://www.historicengland.org.uk
attribution name: Historic England
publisher: www.historicengland.org.uk
scope note: A pungent condiment manufactured from the dried berries of the plant Piper Nigrum. Use for cargoes of peppercorns or ground pepper.

Saffron
type: Concept
broader: Seasonings
in scheme: FISH Maritime Cargo Types Thesaurus
issued: 2021-11-19T14:33:00
license: http://creativecommons.org/licenses/by/3.0
attribution URL: http://www.historicengland.org.uk
attribution name: Historic England
publisher: www.historicengland.org.uk
scope note: The stigmas of the crocus, Crocus sativus, used as a flavouring and for colouring food.

Lead
type: Concept
broader: Metal
narrower: Lead Ingots
in scheme: FISH Maritime Cargo Types Thesaurus
issued: 2021-11-19T14:33:00
license: http://creativecommons.org/licenses/by/3.0
attribution URL: http://www.historicengland.org.uk
attribution name: Historic England
publisher: www.historicengland.org.uk
scope note: A soft, heavy, malleable metal, often obtained from the mineral galena. Traditionally used in the construction industry for roofing and plumbing.

Lead Ingots
type: Concept
broader: Lead
in scheme: FISH Maritime Cargo Types Thesaurus
issued: 2021-11-19T14:33:00
license: http://creativecommons.org/licenses/by/3.0
attribution URL: http://www.historicengland.org.uk
attribution name: Historic England
publisher: www.historicengland.org.uk
scope note: Solid bars made from pure lead.

Marble
type: Concept
broader: Stone
narrower: Marble Blocks
in scheme: FISH Maritime Cargo Types Thesaurus
issued: 2021-11-19T14:33:00
license: http://creativecommons.org/licenses/by/3.0
attribution URL: http://www.historicengland.org.uk
attribution name: Historic England
publisher: www.historicengland.org.uk
scope note: Collective name, in a true geological sense, for a metamorphosed limestone eg. Carrara marble. In British sense, any decorative stone that will take a polish, eg. Purbeck marble.

Marble Blocks
type: Concept
broader: Marble
in scheme: FISH Maritime Cargo Types Thesaurus
issued: 2021-11-19T14:33:00
license: http://creativecommons.org/licenses/by/3.0
attribution URL: http://www.historicengland.org.uk
attribution name: Historic England
publisher: www.historicengland.org.uk
scope note: Blocks cut from marble.

Clothing
type: Concept
broader: Textiles And Clothing
narrower: Uniforms
in scheme: FISH Maritime Cargo Types Thesaurus
issued: 2021-11-19T14:33:00
license: http://creativecommons.org/licenses/by/3.0
attribution URL: http://www.historicengland.org.uk
attribution name: Historic England
publisher: www.historicengland.org.uk
scope note: Items made from cloth, wool etc used as a covering for the human body.

Water
type: Concept
broader: Liquids
narrower: Ice
in scheme: FISH Maritime Cargo Types Thesaurus
issued: 2021-11-19T14:33:00
license: http://creativecommons.org/licenses/by/3.0
attribution URL: http://www.historicengland.org.uk
attribution name: Historic England
publisher: www.historicengland.org.uk
scope note: A clear liquid that forms oceans, rivers etc.

Ice
type: Concept
broader: Water
in scheme: FISH Maritime Cargo Types Thesaurus
issued: 2021-11-19T14:33:00
license: http://creativecommons.org/licenses/by/3.0
attribution URL: http://www.historicengland.org.uk
attribution name: Historic England
publisher: www.historicengland.org.uk
scope note: Frozen water. Prior to the invention of the refrigerator, ice was used to preserve food.

Sulphates
type: Concept
broader: Minerals
broader: Chemicals
in scheme: FISH Maritime Cargo Types Thesaurus
issued: 2021-11-19T14:33:00
license: http://creativecommons.org/licenses/by/3.0
attribution URL: http://www.historicengland.org.uk
attribution name: Historic England
publisher: www.historicengland.org.uk
scope note: A sulphuric acid compound.

Rolling Stock
type: Concept
broader: Vehicles
broader: Railway Components
in scheme: FISH Maritime Cargo Types Thesaurus
issued: 2021-11-19T14:33:00
license: http://creativecommons.org/licenses/by/3.0
attribution URL: http://www.historicengland.org.uk
attribution name: Historic England
publisher: www.historicengland.org.uk
scope note: Carriages, locomotives and other vehicles used on a railway.

Animal Fodder
type: Concept
narrower: Cattle Fodder
broader: Cargo
in scheme: FISH Maritime Cargo Types Thesaurus
issued: 2021-11-19T14:33:00
license: http://creativecommons.org/licenses/by/3.0
attribution URL: http://www.historicengland.org.uk
attribution name: Historic England
publisher: www.historicengland.org.uk
scope note: Food, usually hay or straw, kept for the feeding of animals.

Armour
type: Concept
broader: Manufactured Goods
broader: Military Equipment
in scheme: FISH Maritime Cargo Types Thesaurus
issued: 2021-11-19T14:33:00
license: http://creativecommons.org/licenses/by/3.0
attribution URL: http://www.historicengland.org.uk
attribution name: Historic England
publisher: www.historicengland.org.uk
scope note: Protective equipment, usually made of metal, to protect parts of the body, e.g. helmets, breastplates, or full suits of armour, to protect troops or individuals in warfare. Most examples date from the Middle Ages, obsolete from the 17th century.

Jewellery
type: Concept
broader: Manufactured Goods
in scheme: FISH Maritime Cargo Types Thesaurus
issued: 2021-11-19T14:33:00
license: http://creativecommons.org/licenses/by/3.0
attribution URL: http://www.historicengland.org.uk
attribution name: Historic England
publisher: www.historicengland.org.uk
related: Gemstones
related: Watches
related: Dress Accessories
scope note: Intended for personal decoration, objects made of precious, semi-precious or imitation metals and gemstones.

Fullers Earth
type: Concept
broader: Minerals
broader: Soil
in scheme: FISH Maritime Cargo Types Thesaurus
issued: 2021-11-19T14:33:00
license: http://creativecommons.org/licenses/by/3.0
attribution URL: http://www.historicengland.org.uk
attribution name: Historic England
publisher: www.historicengland.org.uk
scope note: Sedimentary clay with smectite mineral properties, originally used for the cleansing ["fulling"] of cloth; in the 20th century it was used for a wider range of industrial applications.

Tallow
type: Concept
broader: Animal Products
in scheme: FISH Maritime Cargo Types Thesaurus
issued: 2021-11-19T14:33:00
license: http://creativecommons.org/licenses/by/3.0
attribution URL: http://www.historicengland.org.uk
attribution name: Historic England
publisher: www.historicengland.org.uk
related: Blubber
scope note: A fatty substance rendered from animal fat and used in the manufacture of soap, candles and for dressing leather.

Salmon
type: Concept
broader: Fish
narrower: Pickled Salmon
in scheme: FISH Maritime Cargo Types Thesaurus
issued: 2021-11-19T14:33:00
license: http://creativecommons.org/licenses/by/3.0
attribution URL: http://www.historicengland.org.uk
attribution name: Historic England
publisher: www.historicengland.org.uk
scope note: Fish of the Salmonidae family, caught for food.

Pickled Salmon
type: Concept
broader: Salmon
in scheme: FISH Maritime Cargo Types Thesaurus
issued: 2021-11-19T14:33:00
license: http://creativecommons.org/licenses/by/3.0
attribution URL: http://www.historicengland.org.uk
attribution name: Historic England
publisher: www.historicengland.org.uk
scope note: Salmon which has been pickled in vinegar or brine to preserve it.

Honey
type: Concept
broader: Plant Products
broader: Liquids
in scheme: FISH Maritime Cargo Types Thesaurus
issued: 2021-11-19T14:33:00
license: http://creativecommons.org/licenses/by/3.0
attribution URL: http://www.historicengland.org.uk
attribution name: Historic England
publisher: www.historicengland.org.uk
scope note: A sweet fluid substance, the nectar of flowers, gathered and worked up for food by insects such as bees.

Telescopes
type: Concept
broader: Manufactured Goods
in scheme: FISH Maritime Cargo Types Thesaurus
issued: 2021-11-19T14:33:00
license: http://creativecommons.org/licenses/by/3.0
attribution URL: http://www.historicengland.org.uk
attribution name: Historic England
publisher: www.historicengland.org.uk
related: Navigational Instruments
scope note: Optical and/or navigational instruments with powerful lenses for observing remote objects or used in astronomy.

Candles
type: Concept
broader: Household Goods
in scheme: FISH Maritime Cargo Types Thesaurus
issued: 2021-11-19T14:33:00
license: http://creativecommons.org/licenses/by/3.0
attribution URL: http://www.historicengland.org.uk
attribution name: Historic England
publisher: www.historicengland.org.uk
related: Candlesticks
scope note: A body of wax or tallow, usually formed into a long, thin, cylindrical shape enclosing a wick and burnt to produce light.