FISH Resource Description Thesaurus
type: ConceptScheme
issued: 2024-09-19
license: https://www.nationalarchives.gov.uk/doc/open-government-licence/version/3/
attribution URL: https://historicengland.org.uk/
attribution name: Historic England
publisher: historicengland.org.uk
spatial: England
spatial: http://vocab.getty.edu/tgn/7002445
description: Terminology for the description of archive type and format, now updated by FISH (e.g. excavation report, newspaper article, video clip). Originally developed by English Heritage and the National Trust.
has top concept: Resource Type
has top concept: Resource Format And Material

Technical Drawing
type: Concept
alternative label: Technical Illustration
narrower: Plan
narrower: Scale Drawing
narrower: Floorplan
narrower: Overlay
narrower: Topographical Drawing
narrower: Aerial Photograph Transcription
narrower: Excavation Drawing
narrower: Stratigraphic Matrix
narrower: Measured Survey Drawing
broader: Drawing
in scheme: FISH Resource Description Thesaurus
issued: 2024-09-19T12:28:53
license: https://www.nationalarchives.gov.uk/doc/open-government-licence/version/3/
attribution URL: https://historicengland.org.uk/
attribution name: Historic England
publisher: historicengland.org.uk
spatial: http://vocab.getty.edu/tgn/7002445
spatial: England
scope note: A broad class of drawing that is produced following precise conventions of scale and projection. [AAT]

Plan
type: Concept
broader: Technical Drawing
in scheme: FISH Resource Description Thesaurus
issued: 2024-09-19T12:28:53
license: https://www.nationalarchives.gov.uk/doc/open-government-licence/version/3/
attribution URL: https://historicengland.org.uk/
attribution name: Historic England
publisher: historicengland.org.uk
spatial: http://vocab.getty.edu/tgn/7002445
spatial: England
scope note: Used for orthographic drawings in the horizontal plane, generally from above generally depicts localised areas.

Scale Drawing
type: Concept
broader: Technical Drawing
in scheme: FISH Resource Description Thesaurus
issued: 2024-09-19T12:28:53
license: https://www.nationalarchives.gov.uk/doc/open-government-licence/version/3/
attribution URL: https://historicengland.org.uk/
attribution name: Historic England
publisher: historicengland.org.uk
spatial: http://vocab.getty.edu/tgn/7002445
spatial: England
scope note: A scaled drawing based on measurements taken from life.

Floorplan
type: Concept
broader: Technical Drawing
in scheme: FISH Resource Description Thesaurus
issued: 2024-09-19T12:28:53
license: https://www.nationalarchives.gov.uk/doc/open-government-licence/version/3/
attribution URL: https://historicengland.org.uk/
attribution name: Historic England
publisher: historicengland.org.uk
spatial: http://vocab.getty.edu/tgn/7002445
spatial: England
scope note: Plan showing a horizontal section, size and arrangement of rooms within a building, may include location of doors, windows and other features.

Overlay
type: Concept
broader: Technical Drawing
in scheme: FISH Resource Description Thesaurus
issued: 2024-09-19T12:28:53
license: https://www.nationalarchives.gov.uk/doc/open-government-licence/version/3/
attribution URL: https://historicengland.org.uk/
attribution name: Historic England
publisher: historicengland.org.uk
spatial: http://vocab.getty.edu/tgn/7002445
spatial: England
scope note: A drawing, generally on a transparent sheet, which can be placed on top of another image to combine information from both.

Topographical Drawing
type: Concept
broader: Technical Drawing
in scheme: FISH Resource Description Thesaurus
issued: 2024-09-19T12:28:53
license: https://www.nationalarchives.gov.uk/doc/open-government-licence/version/3/
attribution URL: https://historicengland.org.uk/
attribution name: Historic England
publisher: historicengland.org.uk
spatial: http://vocab.getty.edu/tgn/7002445
spatial: England
scope note: A drawing used to convey information about the arrangement and size of features in a defined location under study.

Aerial Photograph Transcription
type: Concept
broader: Technical Drawing
in scheme: FISH Resource Description Thesaurus
issued: 2024-09-19T12:28:53
license: https://www.nationalarchives.gov.uk/doc/open-government-licence/version/3/
attribution URL: https://historicengland.org.uk/
attribution name: Historic England
publisher: historicengland.org.uk
spatial: http://vocab.getty.edu/tgn/7002445
spatial: England
scope note: The process of transcribing the features on an aerial photograph onto a map or plan.

Stratigraphic Matrix
type: Concept
alternative label: Harris Matrix
broader: Technical Drawing
in scheme: FISH Resource Description Thesaurus
issued: 2024-09-19T12:28:53
license: https://www.nationalarchives.gov.uk/doc/open-government-licence/version/3/
attribution URL: https://historicengland.org.uk/
attribution name: Historic England
publisher: historicengland.org.uk
spatial: http://vocab.getty.edu/tgn/7002445
spatial: England
scope note: A schematic diagram showing the relationships of the composition and strata of layers identified during excavation or intervention.

Measured Survey Drawing
type: Concept
alternative label: Antiquity Model
broader: Technical Drawing
in scheme: FISH Resource Description Thesaurus
issued: 2024-09-19T12:28:53
license: https://www.nationalarchives.gov.uk/doc/open-government-licence/version/3/
attribution URL: https://historicengland.org.uk/
attribution name: Historic England
publisher: historicengland.org.uk
spatial: http://vocab.getty.edu/tgn/7002445
spatial: England
scope note: A drawing which depicts to scale a feature within the landscape. For drawings of selected features of a site use SCALE DRAWING..

Leaflet
type: Concept
alternative label: Pamphlet
broader: Publication
in scheme: FISH Resource Description Thesaurus
issued: 2024-09-19T12:28:53
license: https://www.nationalarchives.gov.uk/doc/open-government-licence/version/3/
attribution URL: https://historicengland.org.uk/
attribution name: Historic England
publisher: historicengland.org.uk
spatial: http://vocab.getty.edu/tgn/7002445
spatial: England
scope note: A short published document, often a single sheet, describing a particular place, feature or service to assist visitors and users.

Visitors Book
type: Concept
alternative label: Visitors Diary
broader: Text
in scheme: FISH Resource Description Thesaurus
issued: 2024-09-19T12:28:53
license: https://www.nationalarchives.gov.uk/doc/open-government-licence/version/3/
attribution URL: https://historicengland.org.uk/
attribution name: Historic England
publisher: historicengland.org.uk
spatial: http://vocab.getty.edu/tgn/7002445
spatial: England
scope note: A book in which visitors to a property, monument or exhibition record their thoughts and impressions on their experience.

Newspaper Article
type: Concept
alternative label: Press Cutting
broader: Article
in scheme: FISH Resource Description Thesaurus
issued: 2024-09-19T12:28:53
license: https://www.nationalarchives.gov.uk/doc/open-government-licence/version/3/
attribution URL: https://historicengland.org.uk/
attribution name: Historic England
publisher: historicengland.org.uk
spatial: http://vocab.getty.edu/tgn/7002445
spatial: England
scope note: A written extract taken from a published newspaper.

Off Print
type: Concept
alternative label: Offprint
broader: Publication
in scheme: FISH Resource Description Thesaurus
issued: 2024-09-19T12:28:53
license: https://www.nationalarchives.gov.uk/doc/open-government-licence/version/3/
attribution URL: https://historicengland.org.uk/
attribution name: Historic England
publisher: historicengland.org.uk
spatial: http://vocab.getty.edu/tgn/7002445
spatial: England
scope note: -

Optical Disc
type: Concept
alternative label: Laser Disc
alternative label: Optical Disk
broader: Machine Readable Storage Medium
in scheme: FISH Resource Description Thesaurus
issued: 2024-09-19T12:28:53
license: https://www.nationalarchives.gov.uk/doc/open-government-licence/version/3/
attribution URL: https://historicengland.org.uk/
attribution name: Historic England
publisher: historicengland.org.uk
spatial: http://vocab.getty.edu/tgn/7002445
spatial: England
scope note: Data storage device in disc form that uses lasers to write and access data; can store data in analog or digital form. [AAT]

Digital Versatile Disc
type: Concept
alternative label: Digital Versatile Disk
alternative label: Digital Video Disk
alternative label: DVD
broader: Machine Readable Storage Medium
in scheme: FISH Resource Description Thesaurus
issued: 2024-09-19T12:28:53
license: https://www.nationalarchives.gov.uk/doc/open-government-licence/version/3/
attribution URL: https://historicengland.org.uk/
attribution name: Historic England
publisher: historicengland.org.uk
spatial: http://vocab.getty.edu/tgn/7002445
spatial: England
scope note: A disc capable of holding more data than a conventional CD or CD-Rom. Commonly used as storage medium for film and interactive products.

Radiocarbon Dating Report
type: Concept
alternative label: C14 Dating Report
alternative label: Carbon 14 Dating Report
alternative label: Carbon Dating Report
broader: Scientific Dating Report
in scheme: FISH Resource Description Thesaurus
issued: 2024-09-19T12:28:53
license: https://www.nationalarchives.gov.uk/doc/open-government-licence/version/3/
attribution URL: https://historicengland.org.uk/
attribution name: Historic England
publisher: historicengland.org.uk
spatial: http://vocab.getty.edu/tgn/7002445
spatial: England
scope note: A report that primarily details the results of attempts to assign a date to orgainic material by measuring the amount of carbon 14 it contains.

Dendrochronology Report
type: Concept
alternative label: Tree Ring Dating Report
broader: Scientific Dating Report
in scheme: FISH Resource Description Thesaurus
issued: 2024-09-19T12:28:53
license: https://www.nationalarchives.gov.uk/doc/open-government-licence/version/3/
attribution URL: https://historicengland.org.uk/
attribution name: Historic England
publisher: historicengland.org.uk
spatial: http://vocab.getty.edu/tgn/7002445
spatial: England
scope note: A report that primarily details the results of attempts to assign a date to wooden structures or objects by the comparative study of the growth rings in trees and aged wood.

Compact Disc
type: Concept
alternative label: Compact Disk
alternative label: CD
broader: Machine Readable Storage Medium
in scheme: FISH Resource Description Thesaurus
issued: 2024-09-19T12:28:53
license: https://www.nationalarchives.gov.uk/doc/open-government-licence/version/3/
attribution URL: https://historicengland.org.uk/
attribution name: Historic England
publisher: historicengland.org.uk
spatial: http://vocab.getty.edu/tgn/7002445
spatial: England
scope note: Optical discs on which programs, data, or music are digitally encoded for a laser beam to scan, decode and transmit to a playback system, computer monitor or television set. [AAT]

Floppy Disc
type: Concept
alternative label: Floppy Disk
broader: Machine Readable Storage Medium
in scheme: FISH Resource Description Thesaurus
issued: 2024-09-19T12:28:53
license: https://www.nationalarchives.gov.uk/doc/open-government-licence/version/3/
attribution URL: https://historicengland.org.uk/
attribution name: Historic England
publisher: historicengland.org.uk
spatial: http://vocab.getty.edu/tgn/7002445
spatial: England
scope note: Thin round flexible disc with magnetic surfaces for storing and retrieving data. [AAT]

Report
type: Concept
alternative label: Digital Report
broader: Text
narrower: Historic Landscape Survey Report
narrower: Excavation Report
narrower: Deskbased Survey Report
narrower: Field Survey Report
narrower: Watching Brief Report
narrower: Project Brief
narrower: Project Outline
narrower: Project Specification
narrower: Project Design
narrower: Geophysical Survey Report
narrower: Evaluation Report
narrower: Post Excavation Assessment Report
narrower: Building Recording Report
narrower: Fieldwalking Report
narrower: Heritage Statement
narrower: Interim Report
narrower: Geotechnical Report
narrower: Conservation Area Appraisal Report
narrower: Archaeological Science Report
narrower: Post Excavation Full Analysis Report
narrower: Written Scheme Of Investigation
in scheme: FISH Resource Description Thesaurus
issued: 2024-09-19T12:28:53
license: https://www.nationalarchives.gov.uk/doc/open-government-licence/version/3/
attribution URL: https://historicengland.org.uk/
attribution name: Historic England
publisher: historicengland.org.uk
spatial: http://vocab.getty.edu/tgn/7002445
spatial: England
scope note: A full written presentation of the details of a particular event or investigative technique, often including illustrations and appendices.

Historic Landscape Survey Report
type: Concept
broader: Report
in scheme: FISH Resource Description Thesaurus
issued: 2024-09-19T12:28:53
license: https://www.nationalarchives.gov.uk/doc/open-government-licence/version/3/
attribution URL: https://historicengland.org.uk/
attribution name: Historic England
publisher: historicengland.org.uk
spatial: http://vocab.getty.edu/tgn/7002445
spatial: England
scope note: A report depicting the results generated from an intensive survey of a large area of land including field recording, measured site surveys and land history.

Excavation Report
type: Concept
broader: Report
in scheme: FISH Resource Description Thesaurus
issued: 2024-09-19T12:28:53
license: https://www.nationalarchives.gov.uk/doc/open-government-licence/version/3/
attribution URL: https://historicengland.org.uk/
attribution name: Historic England
publisher: historicengland.org.uk
spatial: http://vocab.getty.edu/tgn/7002445
spatial: England
scope note: A report detailing the results of an archaeological excavation.

Deskbased Survey Report
type: Concept
broader: Report
in scheme: FISH Resource Description Thesaurus
issued: 2024-09-19T12:28:53
license: https://www.nationalarchives.gov.uk/doc/open-government-licence/version/3/
attribution URL: https://historicengland.org.uk/
attribution name: Historic England
publisher: historicengland.org.uk
spatial: http://vocab.getty.edu/tgn/7002445
spatial: England
scope note: A report on the archaeology of an area, based primarily on existing records and resources.

Field Survey Report
type: Concept
broader: Report
in scheme: FISH Resource Description Thesaurus
issued: 2024-09-19T12:28:53
license: https://www.nationalarchives.gov.uk/doc/open-government-licence/version/3/
attribution URL: https://historicengland.org.uk/
attribution name: Historic England
publisher: historicengland.org.uk
spatial: http://vocab.getty.edu/tgn/7002445
spatial: England
scope note: A report detailing the results of a field survey. Usually restricted to a survey of a small or specific area or site.

Watching Brief Report
type: Concept
broader: Report
in scheme: FISH Resource Description Thesaurus
issued: 2024-09-19T12:28:53
license: https://www.nationalarchives.gov.uk/doc/open-government-licence/version/3/
attribution URL: https://historicengland.org.uk/
attribution name: Historic England
publisher: historicengland.org.uk
spatial: http://vocab.getty.edu/tgn/7002445
spatial: England
scope note: A report written as a result of archaeological monitoring during development work.

Project Brief
type: Concept
broader: Report
in scheme: FISH Resource Description Thesaurus
issued: 2024-09-19T12:28:53
license: https://www.nationalarchives.gov.uk/doc/open-government-licence/version/3/
attribution URL: https://historicengland.org.uk/
attribution name: Historic England
publisher: historicengland.org.uk
spatial: http://vocab.getty.edu/tgn/7002445
spatial: England
scope note: An outline of the circumstances to be addressed, with an indication of the scope of work which will be required (English term)

Project Outline
type: Concept
broader: Report
in scheme: FISH Resource Description Thesaurus
issued: 2024-09-19T12:28:53
license: https://www.nationalarchives.gov.uk/doc/open-government-licence/version/3/
attribution URL: https://historicengland.org.uk/
attribution name: Historic England
publisher: historicengland.org.uk
spatial: http://vocab.getty.edu/tgn/7002445
spatial: England
scope note: An outline of the circumstances to be addressed, with an indication of the scope of work which will be required (Scottish term)

Project Specification
type: Concept
broader: Report
in scheme: FISH Resource Description Thesaurus
issued: 2024-09-19T12:28:53
license: https://www.nationalarchives.gov.uk/doc/open-government-licence/version/3/
attribution URL: https://historicengland.org.uk/
attribution name: Historic England
publisher: historicengland.org.uk
spatial: http://vocab.getty.edu/tgn/7002445
spatial: England
scope note: A schedule of work in sufficient detail for it to be quantifiable, implemented and monitored.

Project Design
type: Concept
broader: Report
in scheme: FISH Resource Description Thesaurus
issued: 2024-09-19T12:28:53
license: https://www.nationalarchives.gov.uk/doc/open-government-licence/version/3/
attribution URL: https://historicengland.org.uk/
attribution name: Historic England
publisher: historicengland.org.uk
spatial: http://vocab.getty.edu/tgn/7002445
spatial: England
scope note: A schedule of work set out in sufficient detail for it to be quantifiable, implemented and monitored. Can include contractual details relevant to the commissioning body. A project design may be a research proposal independent of the planning framework

Geophysical Survey Report
type: Concept
broader: Report
in scheme: FISH Resource Description Thesaurus
issued: 2024-09-19T12:28:53
license: https://www.nationalarchives.gov.uk/doc/open-government-licence/version/3/
attribution URL: https://historicengland.org.uk/
attribution name: Historic England
publisher: historicengland.org.uk
spatial: http://vocab.getty.edu/tgn/7002445
spatial: England
scope note: A report that primarily details the results of a survey that was conducted using remote sensing techniques such as resistivity and magnetometry.

Evaluation Report
type: Concept
broader: Report
in scheme: FISH Resource Description Thesaurus
issued: 2024-09-19T12:28:53
license: https://www.nationalarchives.gov.uk/doc/open-government-licence/version/3/
attribution URL: https://historicengland.org.uk/
attribution name: Historic England
publisher: historicengland.org.uk
spatial: http://vocab.getty.edu/tgn/7002445
spatial: England
scope note: A report detailing the results of an archaeological evaluation

Post Excavation Assessment Report
type: Concept
broader: Report
in scheme: FISH Resource Description Thesaurus
issued: 2024-09-19T12:28:53
license: https://www.nationalarchives.gov.uk/doc/open-government-licence/version/3/
attribution URL: https://historicengland.org.uk/
attribution name: Historic England
publisher: historicengland.org.uk
spatial: http://vocab.getty.edu/tgn/7002445
spatial: England
scope note: A report which represents an initial synthesis of the data collected from an excavation ahead of the production of a full publication/post excavation full analysis report.

Building Recording Report
type: Concept
broader: Report
in scheme: FISH Resource Description Thesaurus
issued: 2024-09-19T12:28:53
license: https://www.nationalarchives.gov.uk/doc/open-government-licence/version/3/
attribution URL: https://historicengland.org.uk/
attribution name: Historic England
publisher: historicengland.org.uk
spatial: http://vocab.getty.edu/tgn/7002445
spatial: England
scope note: A report detailing the results of a study of the fabric of a standing building.

Fieldwalking Report
type: Concept
broader: Report
in scheme: FISH Resource Description Thesaurus
issued: 2024-09-19T12:28:53
license: https://www.nationalarchives.gov.uk/doc/open-government-licence/version/3/
attribution URL: https://historicengland.org.uk/
attribution name: Historic England
publisher: historicengland.org.uk
spatial: http://vocab.getty.edu/tgn/7002445
spatial: England
scope note: A report detailing the results of an archaeological event were the ground surface has been studied and any visible archaeological material collected.

Heritage Statement
type: Concept
broader: Report
in scheme: FISH Resource Description Thesaurus
issued: 2024-09-19T12:28:53
license: https://www.nationalarchives.gov.uk/doc/open-government-licence/version/3/
attribution URL: https://historicengland.org.uk/
attribution name: Historic England
publisher: historicengland.org.uk
spatial: http://vocab.getty.edu/tgn/7002445
spatial: England
scope note: A report detailing the archaeological and architectural potential of a site or locality.

Interim Report
type: Concept
broader: Report
in scheme: FISH Resource Description Thesaurus
issued: 2024-09-19T12:28:53
license: https://www.nationalarchives.gov.uk/doc/open-government-licence/version/3/
attribution URL: https://historicengland.org.uk/
attribution name: Historic England
publisher: historicengland.org.uk
spatial: http://vocab.getty.edu/tgn/7002445
spatial: England
scope note: A report detailing the results of archaeological fieldwork that has been produced in advance of a full synthesis of the collected data.

Geotechnical Report
type: Concept
broader: Report
in scheme: FISH Resource Description Thesaurus
issued: 2024-09-19T12:28:53
license: https://www.nationalarchives.gov.uk/doc/open-government-licence/version/3/
attribution URL: https://historicengland.org.uk/
attribution name: Historic England
publisher: historicengland.org.uk
spatial: http://vocab.getty.edu/tgn/7002445
spatial: England
scope note: A report detailing subsurface investigations conducted to assist with the technical rather than archaeological aspects of a proposed development or extraction scheme.

Conservation Area Appraisal Report
type: Concept
broader: Report
in scheme: FISH Resource Description Thesaurus
issued: 2024-09-19T12:28:53
license: https://www.nationalarchives.gov.uk/doc/open-government-licence/version/3/
attribution URL: https://historicengland.org.uk/
attribution name: Historic England
publisher: historicengland.org.uk
spatial: http://vocab.getty.edu/tgn/7002445
spatial: England
scope note: A report providing an objective analysis of the elements which together define the special architectural or historic interest of a specific area.

Post Excavation Full Analysis Report
type: Concept
broader: Report
in scheme: FISH Resource Description Thesaurus
issued: 2024-09-19T12:28:53
license: https://www.nationalarchives.gov.uk/doc/open-government-licence/version/3/
attribution URL: https://historicengland.org.uk/
attribution name: Historic England
publisher: historicengland.org.uk
spatial: http://vocab.getty.edu/tgn/7002445
spatial: England
scope note: A report which represents the final assessment and analysis of an archaeological intervention.

Written Scheme Of Investigation
type: Concept
broader: Report
in scheme: FISH Resource Description Thesaurus
issued: 2024-09-19T12:28:53
license: https://www.nationalarchives.gov.uk/doc/open-government-licence/version/3/
attribution URL: https://historicengland.org.uk/
attribution name: Historic England
publisher: historicengland.org.uk
spatial: http://vocab.getty.edu/tgn/7002445
spatial: England
scope note: A specification that sets out the scope of fieldwork and post-excavation methods required to understand the extent, character and significance of any archaeological remains within a planning application area. A WSI is generally produced in response to a project brief issued by the Local Authority Archaeological Officer.

Document
type: Concept
alternative label: Unpublished Document
broader: Text
in scheme: FISH Resource Description Thesaurus
issued: 2024-09-19T12:28:53
license: https://www.nationalarchives.gov.uk/doc/open-government-licence/version/3/
attribution URL: https://historicengland.org.uk/
attribution name: Historic England
publisher: historicengland.org.uk
spatial: http://vocab.getty.edu/tgn/7002445
spatial: England
scope note: A paper or set of papers with written or printed information, especially of an official type.

Collection
type: Concept
broader: Resource Type
narrower: Planning Archive
narrower: Project Archive
narrower: Finds Collection
narrower: Album
narrower: Catalogue
in scheme: FISH Resource Description Thesaurus
issued: 2024-09-19T12:28:53
license: https://www.nationalarchives.gov.uk/doc/open-government-licence/version/3/
attribution URL: https://historicengland.org.uk/
attribution name: Historic England
publisher: historicengland.org.uk
spatial: http://vocab.getty.edu/tgn/7002445
spatial: England
scope note: A resource comprising of a group of items the parts of which may be separately described and navigated. [DC]

Planning Archive
type: Concept
broader: Collection
in scheme: FISH Resource Description Thesaurus
issued: 2024-09-19T12:28:53
license: https://www.nationalarchives.gov.uk/doc/open-government-licence/version/3/
attribution URL: https://historicengland.org.uk/
attribution name: Historic England
publisher: historicengland.org.uk
spatial: http://vocab.getty.edu/tgn/7002445
spatial: England
scope note: Documents relating to the administration of planning applications.

Project Archive
type: Concept
broader: Collection
in scheme: FISH Resource Description Thesaurus
issued: 2024-09-19T12:28:53
license: https://www.nationalarchives.gov.uk/doc/open-government-licence/version/3/
attribution URL: https://historicengland.org.uk/
attribution name: Historic England
publisher: historicengland.org.uk
spatial: http://vocab.getty.edu/tgn/7002445
spatial: England
scope note: Organised and documented collection of the records made during the course of a project.

Finds Collection
type: Concept
broader: Collection
in scheme: FISH Resource Description Thesaurus
issued: 2024-09-19T12:28:53
license: https://www.nationalarchives.gov.uk/doc/open-government-licence/version/3/
attribution URL: https://historicengland.org.uk/
attribution name: Historic England
publisher: historicengland.org.uk
spatial: http://vocab.getty.edu/tgn/7002445
spatial: England
scope note: Collection of artefacts recovered during archaeological investigation of a site.

Album
type: Concept
broader: Collection
in scheme: FISH Resource Description Thesaurus
issued: 2024-09-19T12:28:53
license: https://www.nationalarchives.gov.uk/doc/open-government-licence/version/3/
attribution URL: https://historicengland.org.uk/
attribution name: Historic England
publisher: historicengland.org.uk
spatial: http://vocab.getty.edu/tgn/7002445
spatial: England
scope note: A collection of items presented in a protective folder.

Resource Type
type: Concept
narrower: Collection
narrower: Dataset
narrower: Image
narrower: Interactive Resource
narrower: Service
narrower: Sound
narrower: Text
narrower: Verbal Communication
in scheme: FISH Resource Description Thesaurus
issued: 2024-09-19T12:28:53
license: https://www.nationalarchives.gov.uk/doc/open-government-licence/version/3/
attribution URL: https://historicengland.org.uk/
attribution name: Historic England
publisher: historicengland.org.uk
spatial: http://vocab.getty.edu/tgn/7002445
spatial: England
scope note: -
top concept of: FISH Resource Description Thesaurus

Verbal Communication
type: Concept
broader: Resource Type
in scheme: FISH Resource Description Thesaurus
issued: 2024-09-19T12:28:53
license: https://www.nationalarchives.gov.uk/doc/open-government-licence/version/3/
attribution URL: https://historicengland.org.uk/
attribution name: Historic England
publisher: historicengland.org.uk
spatial: http://vocab.getty.edu/tgn/7002445
spatial: England
scope note: Factual information conveyed orally to a recipient. Where this has been transcribed, use an appropriate term from the TEXT hierarchy.

Dataset
type: Concept
broader: Resource Type
narrower: Database File
narrower: Cad Data
narrower: Geospatial Data
in scheme: FISH Resource Description Thesaurus
issued: 2024-09-19T12:28:53
license: https://www.nationalarchives.gov.uk/doc/open-government-licence/version/3/
attribution URL: https://historicengland.org.uk/
attribution name: Historic England
publisher: historicengland.org.uk
spatial: http://vocab.getty.edu/tgn/7002445
spatial: England
scope note: Information encoded in a defined structure (for example, lists, tables, and databases), intended to be useful for direct machine processing. [DC] For manual data use index, gazetteer etc.

Database File
type: Concept
broader: Dataset
in scheme: FISH Resource Description Thesaurus
issued: 2024-09-19T12:28:53
license: https://www.nationalarchives.gov.uk/doc/open-government-licence/version/3/
attribution URL: https://historicengland.org.uk/
attribution name: Historic England
publisher: historicengland.org.uk
spatial: http://vocab.getty.edu/tgn/7002445
spatial: England
scope note: Data suitable for processing using database management software.

Cad Data
type: Concept
broader: Dataset
in scheme: FISH Resource Description Thesaurus
issued: 2024-09-19T12:28:53
license: https://www.nationalarchives.gov.uk/doc/open-government-licence/version/3/
attribution URL: https://historicengland.org.uk/
attribution name: Historic England
publisher: historicengland.org.uk
spatial: http://vocab.getty.edu/tgn/7002445
spatial: England
scope note: Data suitable for processing using computer aided design (CAD) packages.

Geospatial Data
type: Concept
broader: Dataset
in scheme: FISH Resource Description Thesaurus
issued: 2024-09-19T12:28:53
license: https://www.nationalarchives.gov.uk/doc/open-government-licence/version/3/
attribution URL: https://historicengland.org.uk/
attribution name: Historic England
publisher: historicengland.org.uk
spatial: http://vocab.getty.edu/tgn/7002445
spatial: England
scope note: Machine readable files suitable for use in a geographic information system (GIS).

Image
type: Concept
broader: Resource Type
narrower: Moving Image
narrower: Photograph
narrower: Map
narrower: Picture
in scheme: FISH Resource Description Thesaurus
issued: 2024-09-19T12:28:53
license: https://www.nationalarchives.gov.uk/doc/open-government-licence/version/3/
attribution URL: https://historicengland.org.uk/
attribution name: Historic England
publisher: historicengland.org.uk
spatial: http://vocab.getty.edu/tgn/7002445
spatial: England
scope note: A visual representation of a physical object, place or person. [DC] Use a more specific term where appropriate.

Interactive Resource
type: Concept
broader: Resource Type
narrower: Teachers Pack
narrower: Webpage
in scheme: FISH Resource Description Thesaurus
issued: 2024-09-19T12:28:53
license: https://www.nationalarchives.gov.uk/doc/open-government-licence/version/3/
attribution URL: https://historicengland.org.uk/
attribution name: Historic England
publisher: historicengland.org.uk
spatial: http://vocab.getty.edu/tgn/7002445
spatial: England
scope note: A resource which requires interaction from the user to be understood, executed, or experienced. [DC]

Teachers Pack
type: Concept
broader: Interactive Resource
in scheme: FISH Resource Description Thesaurus
issued: 2024-09-19T12:28:53
license: https://www.nationalarchives.gov.uk/doc/open-government-licence/version/3/
attribution URL: https://historicengland.org.uk/
attribution name: Historic England
publisher: historicengland.org.uk
spatial: http://vocab.getty.edu/tgn/7002445
spatial: England
scope note: Materials selected and organised to be of use to teachers for use in education.

Webpage
type: Concept
broader: Interactive Resource
in scheme: FISH Resource Description Thesaurus
issued: 2024-09-19T12:28:53
license: https://www.nationalarchives.gov.uk/doc/open-government-licence/version/3/
attribution URL: https://historicengland.org.uk/
attribution name: Historic England
publisher: historicengland.org.uk
spatial: http://vocab.getty.edu/tgn/7002445
spatial: England
scope note: A file of computer information stored on a computer connected to the internet coded so that it can be accessed over the internet using browser software.

Service
type: Concept
broader: Resource Type
narrower: Online Database
in scheme: FISH Resource Description Thesaurus
issued: 2024-09-19T12:28:53
license: https://www.nationalarchives.gov.uk/doc/open-government-licence/version/3/
attribution URL: https://historicengland.org.uk/
attribution name: Historic England
publisher: historicengland.org.uk
spatial: http://vocab.getty.edu/tgn/7002445
spatial: England
scope note: A service is a system that provides one or more functions of value to the end-user. Examples include: a photocopying service, a banking service, an authentication service, inter-library loans, a Z39.50 or Web server. [DC]

Online Database
type: Concept
broader: Service
in scheme: FISH Resource Description Thesaurus
issued: 2024-09-19T12:28:53
license: https://www.nationalarchives.gov.uk/doc/open-government-licence/version/3/
attribution URL: https://historicengland.org.uk/
attribution name: Historic England
publisher: historicengland.org.uk
spatial: http://vocab.getty.edu/tgn/7002445
spatial: England
scope note: A database stored on a computer linked to the internet, which can be queried and browsed by remote users using the internet.

Sound
type: Concept
broader: Resource Type
narrower: Oral History Recording
narrower: Radio Programme
in scheme: FISH Resource Description Thesaurus
issued: 2024-09-19T12:28:53
license: https://www.nationalarchives.gov.uk/doc/open-government-licence/version/3/
attribution URL: https://historicengland.org.uk/
attribution name: Historic England
publisher: historicengland.org.uk
spatial: http://vocab.getty.edu/tgn/7002445
spatial: England
scope note: A sound is a resource whose content is primarily intended to be rendered as audio. [DC] For example recorded speech, sounds or music.

Oral History Recording
type: Concept
broader: Sound
in scheme: FISH Resource Description Thesaurus
issued: 2024-09-19T12:28:53
license: https://www.nationalarchives.gov.uk/doc/open-government-licence/version/3/
attribution URL: https://historicengland.org.uk/
attribution name: Historic England
publisher: historicengland.org.uk
spatial: http://vocab.getty.edu/tgn/7002445
spatial: England
scope note: Recorded interview intended to preserve the recollections of persons whose experiences or memories are representative of historical life.

Radio Programme
type: Concept
broader: Sound
in scheme: FISH Resource Description Thesaurus
issued: 2024-09-19T12:28:53
license: https://www.nationalarchives.gov.uk/doc/open-government-licence/version/3/
attribution URL: https://historicengland.org.uk/
attribution name: Historic England
publisher: historicengland.org.uk
spatial: http://vocab.getty.edu/tgn/7002445
spatial: England
scope note: Recording of a complete broadcast radio programme.

Text
type: Concept
broader: Resource Type
narrower: Correspondence
narrower: Publication
narrower: Diary
narrower: Index
narrower: Notebook
narrower: Report
narrower: Record Form
narrower: Manuscript
narrower: Oral History Transcript
narrower: Visitors Book
narrower: Official Designation Notification
narrower: Document
in scheme: FISH Resource Description Thesaurus
issued: 2024-09-19T12:28:53
license: https://www.nationalarchives.gov.uk/doc/open-government-licence/version/3/
attribution URL: https://historicengland.org.uk/
attribution name: Historic England
publisher: historicengland.org.uk
spatial: http://vocab.getty.edu/tgn/7002445
spatial: England
scope note: A resource whose content is primarily words for reading. For example - books, letters, dissertations, poems, newspapers, articles, archives of mailing lists. [DC]

Correspondence
type: Concept
broader: Text
in scheme: FISH Resource Description Thesaurus
issued: 2024-09-19T12:28:53
license: https://www.nationalarchives.gov.uk/doc/open-government-licence/version/3/
attribution URL: https://historicengland.org.uk/
attribution name: Historic England
publisher: historicengland.org.uk
spatial: http://vocab.getty.edu/tgn/7002445
spatial: England
scope note: Written communication, generally in the form of letters.

Notebook
type: Concept
broader: Text
in scheme: FISH Resource Description Thesaurus
issued: 2024-09-19T12:28:53
license: https://www.nationalarchives.gov.uk/doc/open-government-licence/version/3/
attribution URL: https://historicengland.org.uk/
attribution name: Historic England
publisher: historicengland.org.uk
spatial: http://vocab.getty.edu/tgn/7002445
spatial: England
scope note: Book used to record information or impressions in the field, often as a preparation for more formal reporting at a later date.

Manuscript
type: Concept
broader: Text
in scheme: FISH Resource Description Thesaurus
issued: 2024-09-19T12:28:53
license: https://www.nationalarchives.gov.uk/doc/open-government-licence/version/3/
attribution URL: https://historicengland.org.uk/
attribution name: Historic England
publisher: historicengland.org.uk
spatial: http://vocab.getty.edu/tgn/7002445
spatial: England
scope note: An unpublished document.

Oral History Transcript
type: Concept
broader: Text
in scheme: FISH Resource Description Thesaurus
issued: 2024-09-19T12:28:53
license: https://www.nationalarchives.gov.uk/doc/open-government-licence/version/3/
attribution URL: https://historicengland.org.uk/
attribution name: Historic England
publisher: historicengland.org.uk
spatial: http://vocab.getty.edu/tgn/7002445
spatial: England
scope note: Written copy of recorded interviews collected to illustrate history from personal experiences.

Machine Readable Storage Medium
type: Concept
broader: Resource Format And Material
narrower: Magnetic Storage Medium
narrower: Digital Versatile Disc
narrower: Compact Disc
narrower: Floppy Disc
narrower: Computer File
narrower: Optical Disc
in scheme: FISH Resource Description Thesaurus
issued: 2024-09-19T12:28:53
license: https://www.nationalarchives.gov.uk/doc/open-government-licence/version/3/
attribution URL: https://historicengland.org.uk/
attribution name: Historic England
publisher: historicengland.org.uk
spatial: http://vocab.getty.edu/tgn/7002445
spatial: England
scope note: Storage medium for information (text, images, files etc) in an encoded digital format.

Computer File
type: Concept
broader: Machine Readable Storage Medium
in scheme: FISH Resource Description Thesaurus
issued: 2024-09-19T12:28:53
license: https://www.nationalarchives.gov.uk/doc/open-government-licence/version/3/
attribution URL: https://historicengland.org.uk/
attribution name: Historic England
publisher: historicengland.org.uk
spatial: http://vocab.getty.edu/tgn/7002445
spatial: England
scope note: Data stored in a format that is meant to be manipulated and read in one or more software systems.

Resource Format And Material
type: Concept
narrower: Machine Readable Storage Medium
narrower: Visual Medium
narrower: Hardcopy
in scheme: FISH Resource Description Thesaurus
issued: 2024-09-19T12:28:53
license: https://www.nationalarchives.gov.uk/doc/open-government-licence/version/3/
attribution URL: https://historicengland.org.uk/
attribution name: Historic England
publisher: historicengland.org.uk
spatial: http://vocab.getty.edu/tgn/7002445
spatial: England
scope note: -
top concept of: FISH Resource Description Thesaurus

Magnetic Storage Medium
type: Concept
broader: Machine Readable Storage Medium
narrower: Audio Tape
narrower: Video Tape
in scheme: FISH Resource Description Thesaurus
issued: 2024-09-19T12:28:53
license: https://www.nationalarchives.gov.uk/doc/open-government-licence/version/3/
attribution URL: https://historicengland.org.uk/
attribution name: Historic England
publisher: historicengland.org.uk
spatial: http://vocab.getty.edu/tgn/7002445
spatial: England
scope note: The storage of material (text, images, files etc) in an electromagnetic format.

Audio Tape
type: Concept
broader: Magnetic Storage Medium
in scheme: FISH Resource Description Thesaurus
issued: 2024-09-19T12:28:53
license: https://www.nationalarchives.gov.uk/doc/open-government-licence/version/3/
attribution URL: https://historicengland.org.uk/
attribution name: Historic England
publisher: historicengland.org.uk
spatial: http://vocab.getty.edu/tgn/7002445
spatial: England
scope note: Magnetic tape used to record sound. Includes both cassette and reel tapes.

Video Tape
type: Concept
broader: Magnetic Storage Medium
in scheme: FISH Resource Description Thesaurus
issued: 2024-09-19T12:28:53
license: https://www.nationalarchives.gov.uk/doc/open-government-licence/version/3/
attribution URL: https://historicengland.org.uk/
attribution name: Historic England
publisher: historicengland.org.uk
spatial: http://vocab.getty.edu/tgn/7002445
spatial: England
scope note: A magnetic tape used to record moving images and sound. Use for both cassette and reel tapes.

Visual Medium
type: Concept
broader: Resource Format And Material
narrower: Photographic Medium
narrower: Film Reel
in scheme: FISH Resource Description Thesaurus
issued: 2024-09-19T12:28:53
license: https://www.nationalarchives.gov.uk/doc/open-government-licence/version/3/
attribution URL: https://historicengland.org.uk/
attribution name: Historic England
publisher: historicengland.org.uk
spatial: http://vocab.getty.edu/tgn/7002445
spatial: England
scope note: Any material that records, holds and communicates information in a primarily visual manner.

Film Reel
type: Concept
broader: Visual Medium
in scheme: FISH Resource Description Thesaurus
issued: 2024-09-19T12:28:53
license: https://www.nationalarchives.gov.uk/doc/open-government-licence/version/3/
attribution URL: https://historicengland.org.uk/
attribution name: Historic England
publisher: historicengland.org.uk
spatial: http://vocab.getty.edu/tgn/7002445
spatial: England
scope note: Positive image on continuous film strip suitable for projection of moving images.

Hardcopy
type: Concept
broader: Resource Format And Material
narrower: Tracing Paper
narrower: Drafting Film
narrower: Paper
narrower: Waterproof Paper
narrower: Photocopy
narrower: Fax
narrower: Print Out
narrower: Card
narrower: Newsprint
in scheme: FISH Resource Description Thesaurus
issued: 2024-09-19T12:28:53
license: https://www.nationalarchives.gov.uk/doc/open-government-licence/version/3/
attribution URL: https://historicengland.org.uk/
attribution name: Historic England
publisher: historicengland.org.uk
spatial: http://vocab.getty.edu/tgn/7002445
spatial: England
scope note: Item in a format suitable for normal reading or viewing, without a computer or other device. For digital files or disks use MACHINE READABLE STORAGE MEDIUM or specific terms.

Tracing Paper
type: Concept
broader: Hardcopy
in scheme: FISH Resource Description Thesaurus
issued: 2024-09-19T12:28:53
license: https://www.nationalarchives.gov.uk/doc/open-government-licence/version/3/
attribution URL: https://historicengland.org.uk/
attribution name: Historic England
publisher: historicengland.org.uk
spatial: http://vocab.getty.edu/tgn/7002445
spatial: England
scope note: A translucent paper, which when laid over an existing image, permits the image to be seen and/or traced.

Drafting Film
type: Concept
broader: Hardcopy
in scheme: FISH Resource Description Thesaurus
issued: 2024-09-19T12:28:53
license: https://www.nationalarchives.gov.uk/doc/open-government-licence/version/3/
attribution URL: https://historicengland.org.uk/
attribution name: Historic England
publisher: historicengland.org.uk
spatial: http://vocab.getty.edu/tgn/7002445
spatial: England
scope note: A heavy grade, water proof plastic film used for the preparation of technical drawings.

Paper
type: Concept
broader: Hardcopy
in scheme: FISH Resource Description Thesaurus
issued: 2024-09-19T12:28:53
license: https://www.nationalarchives.gov.uk/doc/open-government-licence/version/3/
attribution URL: https://historicengland.org.uk/
attribution name: Historic England
publisher: historicengland.org.uk
spatial: http://vocab.getty.edu/tgn/7002445
spatial: England
scope note: A thin opaque, slightly absorbent material, generally made from processing of plant or other fibres, for use as a medium for writing, drawing and printing.

Waterproof Paper
type: Concept
broader: Hardcopy
in scheme: FISH Resource Description Thesaurus
issued: 2024-09-19T12:28:53
license: https://www.nationalarchives.gov.uk/doc/open-government-licence/version/3/
attribution URL: https://historicengland.org.uk/
attribution name: Historic England
publisher: historicengland.org.uk
spatial: http://vocab.getty.edu/tgn/7002445
spatial: England
scope note: Paper made for writing or drawing underwater.

Photocopy
type: Concept
broader: Hardcopy
in scheme: FISH Resource Description Thesaurus
issued: 2024-09-19T12:28:53
license: https://www.nationalarchives.gov.uk/doc/open-government-licence/version/3/
attribution URL: https://historicengland.org.uk/
attribution name: Historic England
publisher: historicengland.org.uk
spatial: http://vocab.getty.edu/tgn/7002445
spatial: England
scope note: A photographic reproduction of written or printed material produced by using toner particles under heat and pressure to fuse a copy onto blank paper.

Fax
type: Concept
broader: Hardcopy
in scheme: FISH Resource Description Thesaurus
issued: 2024-09-19T12:28:53
license: https://www.nationalarchives.gov.uk/doc/open-government-licence/version/3/
attribution URL: https://historicengland.org.uk/
attribution name: Historic England
publisher: historicengland.org.uk
spatial: http://vocab.getty.edu/tgn/7002445
spatial: England
scope note: -

Print Out
type: Concept
broader: Hardcopy
in scheme: FISH Resource Description Thesaurus
issued: 2024-09-19T12:28:53
license: https://www.nationalarchives.gov.uk/doc/open-government-licence/version/3/
attribution URL: https://historicengland.org.uk/
attribution name: Historic England
publisher: historicengland.org.uk
spatial: http://vocab.getty.edu/tgn/7002445
spatial: England
scope note: A hard copy of digital data that has been printed onto paper.

Card
type: Concept
broader: Hardcopy
in scheme: FISH Resource Description Thesaurus
issued: 2024-09-19T12:28:53
license: https://www.nationalarchives.gov.uk/doc/open-government-licence/version/3/
attribution URL: https://historicengland.org.uk/
attribution name: Historic England
publisher: historicengland.org.uk
spatial: http://vocab.getty.edu/tgn/7002445
spatial: England
scope note: A material stronger than paper, generally made from wood pulp.

Newsprint
type: Concept
broader: Hardcopy
in scheme: FISH Resource Description Thesaurus
issued: 2024-09-19T12:28:53
license: https://www.nationalarchives.gov.uk/doc/open-government-licence/version/3/
attribution URL: https://historicengland.org.uk/
attribution name: Historic England
publisher: historicengland.org.uk
spatial: http://vocab.getty.edu/tgn/7002445
spatial: England
scope note: A cheap and relatively rough paper on which newspapers are printed.

Catalogue
type: Concept
broader: Collection
narrower: Gazetteer
in scheme: FISH Resource Description Thesaurus
issued: 2024-09-19T12:28:53
license: https://www.nationalarchives.gov.uk/doc/open-government-licence/version/3/
attribution URL: https://historicengland.org.uk/
attribution name: Historic England
publisher: historicengland.org.uk
spatial: http://vocab.getty.edu/tgn/7002445
spatial: England
scope note: Structured descriptions of an archive or collection used to assist retrieval and management, or presentation to the public.

Gazetteer
type: Concept
broader: Catalogue
in scheme: FISH Resource Description Thesaurus
issued: 2024-09-19T12:28:53
license: https://www.nationalarchives.gov.uk/doc/open-government-licence/version/3/
attribution URL: https://historicengland.org.uk/
attribution name: Historic England
publisher: historicengland.org.uk
spatial: http://vocab.getty.edu/tgn/7002445
spatial: England
scope note: Structured list of information about items of interest to a research project, for example monuments of a particular type.

Moving Image
type: Concept
broader: Image
narrower: Video Clip
narrower: Television Programme
in scheme: FISH Resource Description Thesaurus
issued: 2024-09-19T12:28:53
license: https://www.nationalarchives.gov.uk/doc/open-government-licence/version/3/
attribution URL: https://historicengland.org.uk/
attribution name: Historic England
publisher: historicengland.org.uk
spatial: http://vocab.getty.edu/tgn/7002445
spatial: England
scope note: Broad term for all types of animated or live action images.

Video Clip
type: Concept
broader: Moving Image
in scheme: FISH Resource Description Thesaurus
issued: 2024-09-19T12:28:53
license: https://www.nationalarchives.gov.uk/doc/open-government-licence/version/3/
attribution URL: https://historicengland.org.uk/
attribution name: Historic England
publisher: historicengland.org.uk
spatial: http://vocab.getty.edu/tgn/7002445
spatial: England
scope note: An extract from a longer video film, used as an illustration.

Television Programme
type: Concept
broader: Moving Image
in scheme: FISH Resource Description Thesaurus
issued: 2024-09-19T12:28:53
license: https://www.nationalarchives.gov.uk/doc/open-government-licence/version/3/
attribution URL: https://historicengland.org.uk/
attribution name: Historic England
publisher: historicengland.org.uk
spatial: http://vocab.getty.edu/tgn/7002445
spatial: England
scope note: Recording of a complete broadcast television programme, for instance a documentary. For extracts such as items from news broadcasts use VIDEO CLIP.

Photograph
type: Concept
broader: Image
narrower: Aerial Photograph
narrower: Rectified Photograph
in scheme: FISH Resource Description Thesaurus
issued: 2024-09-19T12:28:53
license: https://www.nationalarchives.gov.uk/doc/open-government-licence/version/3/
attribution URL: https://historicengland.org.uk/
attribution name: Historic England
publisher: historicengland.org.uk
spatial: http://vocab.getty.edu/tgn/7002445
spatial: England
scope note: An image created by controlled exposure of light sensitive film. Usually a static image in time and space. For digital photographs double index with an appropriate term under MACHINE READABLE STORAGE MEDIUM.

Rectified Photograph
type: Concept
broader: Photograph
in scheme: FISH Resource Description Thesaurus
issued: 2024-09-19T12:28:53
license: https://www.nationalarchives.gov.uk/doc/open-government-licence/version/3/
attribution URL: https://historicengland.org.uk/
attribution name: Historic England
publisher: historicengland.org.uk
spatial: http://vocab.getty.edu/tgn/7002445
spatial: England
scope note: A photograph usually of a standing structure that has been manipulated to allow the creation of a measured drawing of the facade or elevation.

Aerial Photograph
type: Concept
broader: Photograph
narrower: Oblique Aerial Photograph
narrower: Vertical Aerial Photograph
in scheme: FISH Resource Description Thesaurus
issued: 2024-09-19T12:28:53
license: https://www.nationalarchives.gov.uk/doc/open-government-licence/version/3/
attribution URL: https://historicengland.org.uk/
attribution name: Historic England
publisher: historicengland.org.uk
spatial: http://vocab.getty.edu/tgn/7002445
spatial: England
scope note: A photograph taken from the air.

Oblique Aerial Photograph
type: Concept
broader: Aerial Photograph
in scheme: FISH Resource Description Thesaurus
issued: 2024-09-19T12:28:53
license: https://www.nationalarchives.gov.uk/doc/open-government-licence/version/3/
attribution URL: https://historicengland.org.uk/
attribution name: Historic England
publisher: historicengland.org.uk
spatial: http://vocab.getty.edu/tgn/7002445
spatial: England
scope note: An aerial photograph taken at an angle other than 90 degrees to a feature in the landscape.

Vertical Aerial Photograph
type: Concept
broader: Aerial Photograph
in scheme: FISH Resource Description Thesaurus
issued: 2024-09-19T12:28:53
license: https://www.nationalarchives.gov.uk/doc/open-government-licence/version/3/
attribution URL: https://historicengland.org.uk/
attribution name: Historic England
publisher: historicengland.org.uk
spatial: http://vocab.getty.edu/tgn/7002445
spatial: England
scope note: An aerial photograph taken from directly above a feature in the landscape, suitable for mapping or survey purposes. For photographs taken from the air at an angle to the subject use OBLIQUE AERIAL PHOTOGRAPH.

Map
type: Concept
broader: Image
narrower: Chart
narrower: Sketch Map
in scheme: FISH Resource Description Thesaurus
issued: 2024-09-19T12:28:53
license: https://www.nationalarchives.gov.uk/doc/open-government-licence/version/3/
attribution URL: https://historicengland.org.uk/
attribution name: Historic England
publisher: historicengland.org.uk
spatial: http://vocab.getty.edu/tgn/7002445
spatial: England
scope note: A pictoral depiction of an area of landscape.

Chart
type: Concept
broader: Map
in scheme: FISH Resource Description Thesaurus
issued: 2024-09-19T12:28:53
license: https://www.nationalarchives.gov.uk/doc/open-government-licence/version/3/
attribution URL: https://historicengland.org.uk/
attribution name: Historic England
publisher: historicengland.org.uk
spatial: http://vocab.getty.edu/tgn/7002445
spatial: England
scope note: A depiction of land, coastal or sea areas intended to aid navigation, usually using latitude and longitude co-ordinates.

Sketch Map
type: Concept
broader: Map
in scheme: FISH Resource Description Thesaurus
issued: 2024-09-19T12:28:53
license: https://www.nationalarchives.gov.uk/doc/open-government-licence/version/3/
attribution URL: https://historicengland.org.uk/
attribution name: Historic England
publisher: historicengland.org.uk
spatial: http://vocab.getty.edu/tgn/7002445
spatial: England
scope note: A map generally produced manually to indicate main features of an area quickly, for example to assist location of a particular place.

Picture
type: Concept
broader: Image
narrower: Picture Postcard
narrower: Illustration
narrower: Drawing
narrower: Sketch
narrower: Painting
narrower: Mechanical Print
in scheme: FISH Resource Description Thesaurus
issued: 2024-09-19T12:28:53
license: https://www.nationalarchives.gov.uk/doc/open-government-licence/version/3/
attribution URL: https://historicengland.org.uk/
attribution name: Historic England
publisher: historicengland.org.uk
spatial: http://vocab.getty.edu/tgn/7002445
spatial: England
scope note: General term for images used to represent a particular place or item, or convey information.

Picture Postcard
type: Concept
broader: Picture
in scheme: FISH Resource Description Thesaurus
issued: 2024-09-19T12:28:53
license: https://www.nationalarchives.gov.uk/doc/open-government-licence/version/3/
attribution URL: https://historicengland.org.uk/
attribution name: Historic England
publisher: historicengland.org.uk
spatial: http://vocab.getty.edu/tgn/7002445
spatial: England
scope note: Card printed with an image, often a photograph on one side, and space for a short message and a postal address on the other.

Illustration
type: Concept
broader: Picture
in scheme: FISH Resource Description Thesaurus
issued: 2024-09-19T12:28:53
license: https://www.nationalarchives.gov.uk/doc/open-government-licence/version/3/
attribution URL: https://historicengland.org.uk/
attribution name: Historic England
publisher: historicengland.org.uk
spatial: http://vocab.getty.edu/tgn/7002445
spatial: England
scope note: An image used to convey information, often as part of a larger publication or exhibition.

Sketch
type: Concept
broader: Picture
in scheme: FISH Resource Description Thesaurus
issued: 2024-09-19T12:28:53
license: https://www.nationalarchives.gov.uk/doc/open-government-licence/version/3/
attribution URL: https://historicengland.org.uk/
attribution name: Historic England
publisher: historicengland.org.uk
spatial: http://vocab.getty.edu/tgn/7002445
spatial: England
scope note: A drawing, often made in the field as the basis for later work, or to quickly convey important information.

Painting
type: Concept
broader: Picture
in scheme: FISH Resource Description Thesaurus
issued: 2024-09-19T12:28:53
license: https://www.nationalarchives.gov.uk/doc/open-government-licence/version/3/
attribution URL: https://historicengland.org.uk/
attribution name: Historic England
publisher: historicengland.org.uk
spatial: http://vocab.getty.edu/tgn/7002445
spatial: England
scope note: An image created manually using paint or pigments, to record, illustrate or convey impressions.

Sketch Plan
type: Concept
broader: Drawing
in scheme: FISH Resource Description Thesaurus
issued: 2024-09-19T12:28:53
license: https://www.nationalarchives.gov.uk/doc/open-government-licence/version/3/
attribution URL: https://historicengland.org.uk/
attribution name: Historic England
publisher: historicengland.org.uk
spatial: http://vocab.getty.edu/tgn/7002445
spatial: England
scope note: A plan of a feature or small area generally done in the field to quickly record the main features.

Drawing
type: Concept
narrower: Sketch Plan
narrower: Reconstruction Drawing
narrower: Artefact Drawing
narrower: Technical Drawing
broader: Picture
in scheme: FISH Resource Description Thesaurus
issued: 2024-09-19T12:28:53
license: https://www.nationalarchives.gov.uk/doc/open-government-licence/version/3/
attribution URL: https://historicengland.org.uk/
attribution name: Historic England
publisher: historicengland.org.uk
spatial: http://vocab.getty.edu/tgn/7002445
spatial: England
scope note: A manually produced image for illustration or record purposes.

Reconstruction Drawing
type: Concept
broader: Drawing
in scheme: FISH Resource Description Thesaurus
issued: 2024-09-19T12:28:53
license: https://www.nationalarchives.gov.uk/doc/open-government-licence/version/3/
attribution URL: https://historicengland.org.uk/
attribution name: Historic England
publisher: historicengland.org.uk
spatial: http://vocab.getty.edu/tgn/7002445
spatial: England
scope note: A representation of a monument or landscape based on historical or archaeological information.

Artefact Drawing
type: Concept
broader: Drawing
in scheme: FISH Resource Description Thesaurus
issued: 2024-09-19T12:28:53
license: https://www.nationalarchives.gov.uk/doc/open-government-licence/version/3/
attribution URL: https://historicengland.org.uk/
attribution name: Historic England
publisher: historicengland.org.uk
spatial: http://vocab.getty.edu/tgn/7002445
spatial: England
scope note: A drawn representation of an archaeological 'find' or other cultural object.

Engraving
type: Concept
broader: Mechanical Print
in scheme: FISH Resource Description Thesaurus
issued: 2024-09-19T12:28:53
license: https://www.nationalarchives.gov.uk/doc/open-government-licence/version/3/
attribution URL: https://historicengland.org.uk/
attribution name: Historic England
publisher: historicengland.org.uk
spatial: http://vocab.getty.edu/tgn/7002445
spatial: England
scope note: An image produced by creating marks on a hard material from which a print is then taken.

Mechanical Print
type: Concept
narrower: Engraving
narrower: Woodcut
broader: Picture
in scheme: FISH Resource Description Thesaurus
issued: 2024-09-19T12:28:53
license: https://www.nationalarchives.gov.uk/doc/open-government-licence/version/3/
attribution URL: https://historicengland.org.uk/
attribution name: Historic England
publisher: historicengland.org.uk
spatial: http://vocab.getty.edu/tgn/7002445
spatial: England
scope note: Reproduced image derived by mechanical printing from an image engraved or carved on a suitable surface.

Woodcut
type: Concept
broader: Mechanical Print
in scheme: FISH Resource Description Thesaurus
issued: 2024-09-19T12:28:53
license: https://www.nationalarchives.gov.uk/doc/open-government-licence/version/3/
attribution URL: https://historicengland.org.uk/
attribution name: Historic England
publisher: historicengland.org.uk
spatial: http://vocab.getty.edu/tgn/7002445
spatial: England
scope note: A relief process in which the design is cut into and printed from the plank side of a wood block [AAT].

Publication
type: Concept
broader: Text
narrower: Book
narrower: Monograph
narrower: Article
narrower: Leaflet
narrower: Newsletter
narrower: Serial
narrower: Volume
narrower: Series
narrower: Off Print
narrower: Guide Book
in scheme: FISH Resource Description Thesaurus
issued: 2024-09-19T12:28:53
license: https://www.nationalarchives.gov.uk/doc/open-government-licence/version/3/
attribution URL: https://historicengland.org.uk/
attribution name: Historic England
publisher: historicengland.org.uk
spatial: http://vocab.getty.edu/tgn/7002445
spatial: England
scope note: General term for documents that have been produced in large numbers for public sale or distribution.

Book
type: Concept
broader: Publication
in scheme: FISH Resource Description Thesaurus
issued: 2024-09-19T12:28:53
license: https://www.nationalarchives.gov.uk/doc/open-government-licence/version/3/
attribution URL: https://historicengland.org.uk/
attribution name: Historic England
publisher: historicengland.org.uk
spatial: http://vocab.getty.edu/tgn/7002445
spatial: England
scope note: A written or printed work consisting of pages glued or sewn together along one side and bound in covers.

Monograph
type: Concept
broader: Publication
in scheme: FISH Resource Description Thesaurus
issued: 2024-09-19T12:28:53
license: https://www.nationalarchives.gov.uk/doc/open-government-licence/version/3/
attribution URL: https://historicengland.org.uk/
attribution name: Historic England
publisher: historicengland.org.uk
spatial: http://vocab.getty.edu/tgn/7002445
spatial: England
scope note: Publication on a specific topic, or limited scope of subject matter. Complete in itself, though may form part of a series.

Newsletter
type: Concept
broader: Publication
in scheme: FISH Resource Description Thesaurus
issued: 2024-09-19T12:28:53
license: https://www.nationalarchives.gov.uk/doc/open-government-licence/version/3/
attribution URL: https://historicengland.org.uk/
attribution name: Historic England
publisher: historicengland.org.uk
spatial: http://vocab.getty.edu/tgn/7002445
spatial: England
scope note: Short publication used to disseminate information about a particular project or organisation, issued on a regular basis.

Volume
type: Concept
broader: Publication
in scheme: FISH Resource Description Thesaurus
issued: 2024-09-19T12:28:53
license: https://www.nationalarchives.gov.uk/doc/open-government-licence/version/3/
attribution URL: https://historicengland.org.uk/
attribution name: Historic England
publisher: historicengland.org.uk
spatial: http://vocab.getty.edu/tgn/7002445
spatial: England
scope note: A bound written work.

Series
type: Concept
broader: Publication
in scheme: FISH Resource Description Thesaurus
issued: 2024-09-19T12:28:53
license: https://www.nationalarchives.gov.uk/doc/open-government-licence/version/3/
attribution URL: https://historicengland.org.uk/
attribution name: Historic England
publisher: historicengland.org.uk
spatial: http://vocab.getty.edu/tgn/7002445
spatial: England
scope note: A written work issued in parts, with the intention of creating a completed sequence.

Guide Book
type: Concept
broader: Publication
in scheme: FISH Resource Description Thesaurus
issued: 2024-09-19T12:28:53
license: https://www.nationalarchives.gov.uk/doc/open-government-licence/version/3/
attribution URL: https://historicengland.org.uk/
attribution name: Historic England
publisher: historicengland.org.uk
spatial: http://vocab.getty.edu/tgn/7002445
spatial: England
scope note: A book containing information about a place that has been produced for the use of visitors or tourists.

Article
type: Concept
broader: Publication
narrower: Newspaper Article
in scheme: FISH Resource Description Thesaurus
issued: 2024-09-19T12:28:53
license: https://www.nationalarchives.gov.uk/doc/open-government-licence/version/3/
attribution URL: https://historicengland.org.uk/
attribution name: Historic England
publisher: historicengland.org.uk
spatial: http://vocab.getty.edu/tgn/7002445
spatial: England
scope note: A written work for publication, being one of several found in a serial, monograph or magazine.

Serial
type: Concept
broader: Publication
narrower: Journal
in scheme: FISH Resource Description Thesaurus
issued: 2024-09-19T12:28:53
license: https://www.nationalarchives.gov.uk/doc/open-government-licence/version/3/
attribution URL: https://historicengland.org.uk/
attribution name: Historic England
publisher: historicengland.org.uk
spatial: http://vocab.getty.edu/tgn/7002445
spatial: England
scope note: A written work issued at regular intervals, numbered consecutively with no intended or planned end point.

Journal
type: Concept
broader: Serial
in scheme: FISH Resource Description Thesaurus
issued: 2024-09-19T12:28:53
license: https://www.nationalarchives.gov.uk/doc/open-government-licence/version/3/
attribution URL: https://historicengland.org.uk/
attribution name: Historic England
publisher: historicengland.org.uk
spatial: http://vocab.getty.edu/tgn/7002445
spatial: England
scope note: A publication that contains scholarly articles and is published regularly. Journals are often written by experts in a specific field and are peer reviewed before publication.

Diary
type: Concept
broader: Text
narrower: Excavation Diary
in scheme: FISH Resource Description Thesaurus
issued: 2024-09-19T12:28:53
license: https://www.nationalarchives.gov.uk/doc/open-government-licence/version/3/
attribution URL: https://historicengland.org.uk/
attribution name: Historic England
publisher: historicengland.org.uk
spatial: http://vocab.getty.edu/tgn/7002445
spatial: England
scope note: A chronological journal, generally showing appointments, or recording memories and impressions of a days events over a period of time.

Excavation Diary
type: Concept
broader: Diary
in scheme: FISH Resource Description Thesaurus
issued: 2024-09-19T12:28:53
license: https://www.nationalarchives.gov.uk/doc/open-government-licence/version/3/
attribution URL: https://historicengland.org.uk/
attribution name: Historic England
publisher: historicengland.org.uk
spatial: http://vocab.getty.edu/tgn/7002445
spatial: England
scope note: A diary used to record the events and activities during an excavation.

Index
type: Concept
broader: Text
narrower: Card Index
in scheme: FISH Resource Description Thesaurus
issued: 2024-09-19T12:28:53
license: https://www.nationalarchives.gov.uk/doc/open-government-licence/version/3/
attribution URL: https://historicengland.org.uk/
attribution name: Historic England
publisher: historicengland.org.uk
spatial: http://vocab.getty.edu/tgn/7002445
spatial: England
scope note: A structured set of data taken from a larger work to assist in location of particular subject matter.

Card Index
type: Concept
broader: Index
in scheme: FISH Resource Description Thesaurus
issued: 2024-09-19T12:28:53
license: https://www.nationalarchives.gov.uk/doc/open-government-licence/version/3/
attribution URL: https://historicengland.org.uk/
attribution name: Historic England
publisher: historicengland.org.uk
spatial: http://vocab.getty.edu/tgn/7002445
spatial: England
scope note: Cards, often printed with forms, for the recording and sorting of information in a structured manner.

Record Form
type: Concept
broader: Text
narrower: Context Sheet
narrower: Field Recording Form
narrower: Project Recording Form
in scheme: FISH Resource Description Thesaurus
issued: 2024-09-19T12:28:53
license: https://www.nationalarchives.gov.uk/doc/open-government-licence/version/3/
attribution URL: https://historicengland.org.uk/
attribution name: Historic England
publisher: historicengland.org.uk
spatial: http://vocab.getty.edu/tgn/7002445
spatial: England
scope note: A paper form used to record specific information in a systematic way.

Context Sheet
type: Concept
broader: Record Form
in scheme: FISH Resource Description Thesaurus
issued: 2024-09-19T12:28:53
license: https://www.nationalarchives.gov.uk/doc/open-government-licence/version/3/
attribution URL: https://historicengland.org.uk/
attribution name: Historic England
publisher: historicengland.org.uk
spatial: http://vocab.getty.edu/tgn/7002445
spatial: England
scope note: A form used to record the details of a feature identified by archaeological investigation, generally including location, depth, colour, texture, inclusions and stratigraphic relationship to other contexts.

Field Recording Form
type: Concept
broader: Record Form
in scheme: FISH Resource Description Thesaurus
issued: 2024-09-19T12:28:53
license: https://www.nationalarchives.gov.uk/doc/open-government-licence/version/3/
attribution URL: https://historicengland.org.uk/
attribution name: Historic England
publisher: historicengland.org.uk
spatial: http://vocab.getty.edu/tgn/7002445
spatial: England
scope note: A form to record the details of a monument or site found during the course of a field survey or visit.

Project Recording Form
type: Concept
broader: Record Form
in scheme: FISH Resource Description Thesaurus
issued: 2024-09-19T12:28:53
license: https://www.nationalarchives.gov.uk/doc/open-government-licence/version/3/
attribution URL: https://historicengland.org.uk/
attribution name: Historic England
publisher: historicengland.org.uk
spatial: http://vocab.getty.edu/tgn/7002445
spatial: England
scope note: A form that records the details of a project, for example, an excavation index form.

Excavation Drawing
type: Concept
broader: Technical Drawing
narrower: Section Drawing
narrower: Context Plan
in scheme: FISH Resource Description Thesaurus
issued: 2024-09-19T12:28:53
license: https://www.nationalarchives.gov.uk/doc/open-government-licence/version/3/
attribution URL: https://historicengland.org.uk/
attribution name: Historic England
publisher: historicengland.org.uk
spatial: http://vocab.getty.edu/tgn/7002445
spatial: England
scope note: A schematic depiction of the results of an archaeological excavation.

Section Drawing
type: Concept
broader: Excavation Drawing
in scheme: FISH Resource Description Thesaurus
issued: 2024-09-19T12:28:53
license: https://www.nationalarchives.gov.uk/doc/open-government-licence/version/3/
attribution URL: https://historicengland.org.uk/
attribution name: Historic England
publisher: historicengland.org.uk
spatial: http://vocab.getty.edu/tgn/7002445
spatial: England
scope note: Drawing of the vertical face of an excavated feature or features depicting the vertical extent and stratigraphic relationship between identified layers or deposits.

Context Plan
type: Concept
broader: Excavation Drawing
in scheme: FISH Resource Description Thesaurus
issued: 2024-09-19T12:28:53
license: https://www.nationalarchives.gov.uk/doc/open-government-licence/version/3/
attribution URL: https://historicengland.org.uk/
attribution name: Historic England
publisher: historicengland.org.uk
spatial: http://vocab.getty.edu/tgn/7002445
spatial: England
scope note: Scale drawing showing the horizontal extent, height and arrangement of an excavated layer or feature on an archaeological site.

Photographic Medium
type: Concept
broader: Visual Medium
narrower: Infrared Film
narrower: Glass Plate
narrower: Colour Print
narrower: Black And White Print
narrower: Colour Slide
narrower: Black And White Slide
narrower: Colour Transparency
narrower: Black And White Transparency
narrower: Colour Negative
narrower: Black And White Negative
narrower: Microform
in scheme: FISH Resource Description Thesaurus
issued: 2024-09-19T12:28:53
license: https://www.nationalarchives.gov.uk/doc/open-government-licence/version/3/
attribution URL: https://historicengland.org.uk/
attribution name: Historic England
publisher: historicengland.org.uk
spatial: http://vocab.getty.edu/tgn/7002445
spatial: England
scope note: The class or material that a photograph is produced upon. [AAT] Use a specific term or terms as appropriate.

Infrared Film
type: Concept
broader: Photographic Medium
in scheme: FISH Resource Description Thesaurus
issued: 2024-09-19T12:28:53
license: https://www.nationalarchives.gov.uk/doc/open-government-licence/version/3/
attribution URL: https://historicengland.org.uk/
attribution name: Historic England
publisher: historicengland.org.uk
spatial: http://vocab.getty.edu/tgn/7002445
spatial: England
scope note: Photographic film responsive to infrared radiation. Used to record temperature variations in the subject, indicative of hidden archaeological or architectural features.

Glass Plate
type: Concept
broader: Photographic Medium
in scheme: FISH Resource Description Thesaurus
issued: 2024-09-19T12:28:53
license: https://www.nationalarchives.gov.uk/doc/open-government-licence/version/3/
attribution URL: https://historicengland.org.uk/
attribution name: Historic England
publisher: historicengland.org.uk
spatial: http://vocab.getty.edu/tgn/7002445
spatial: England
scope note: A sheet of glass coated in a light sensitive substance on which a photgraphic image can be developed.

Colour Print
type: Concept
broader: Photographic Medium
in scheme: FISH Resource Description Thesaurus
issued: 2024-09-19T12:28:53
license: https://www.nationalarchives.gov.uk/doc/open-government-licence/version/3/
attribution URL: https://historicengland.org.uk/
attribution name: Historic England
publisher: historicengland.org.uk
spatial: http://vocab.getty.edu/tgn/7002445
spatial: England
scope note: A photographic print of a polychrome image (composed of colours other than, but not exclusive of, black, white or grey tones).

Black And White Print
type: Concept
broader: Photographic Medium
in scheme: FISH Resource Description Thesaurus
issued: 2024-09-19T12:28:53
license: https://www.nationalarchives.gov.uk/doc/open-government-licence/version/3/
attribution URL: https://historicengland.org.uk/
attribution name: Historic England
publisher: historicengland.org.uk
spatial: http://vocab.getty.edu/tgn/7002445
spatial: England
scope note: A photographic print of a mononchrome image (composed of grey, black and white tones).

Colour Slide
type: Concept
broader: Photographic Medium
in scheme: FISH Resource Description Thesaurus
issued: 2024-09-19T12:28:53
license: https://www.nationalarchives.gov.uk/doc/open-government-licence/version/3/
attribution URL: https://historicengland.org.uk/
attribution name: Historic England
publisher: historicengland.org.uk
spatial: http://vocab.getty.edu/tgn/7002445
spatial: England
scope note: A photographic slide of a colour (polychromatic) image.

Black And White Slide
type: Concept
broader: Photographic Medium
in scheme: FISH Resource Description Thesaurus
issued: 2024-09-19T12:28:53
license: https://www.nationalarchives.gov.uk/doc/open-government-licence/version/3/
attribution URL: https://historicengland.org.uk/
attribution name: Historic England
publisher: historicengland.org.uk
spatial: http://vocab.getty.edu/tgn/7002445
spatial: England
scope note: A photographic slide of a black and white (monochromatic) image.

Colour Transparency
type: Concept
broader: Photographic Medium
in scheme: FISH Resource Description Thesaurus
issued: 2024-09-19T12:28:53
license: https://www.nationalarchives.gov.uk/doc/open-government-licence/version/3/
attribution URL: https://historicengland.org.uk/
attribution name: Historic England
publisher: historicengland.org.uk
spatial: http://vocab.getty.edu/tgn/7002445
spatial: England
scope note: A positive colour image on film which can be projected onto a screen when light is shone through it.

Black And White Transparency
type: Concept
broader: Photographic Medium
in scheme: FISH Resource Description Thesaurus
issued: 2024-09-19T12:28:53
license: https://www.nationalarchives.gov.uk/doc/open-government-licence/version/3/
attribution URL: https://historicengland.org.uk/
attribution name: Historic England
publisher: historicengland.org.uk
spatial: http://vocab.getty.edu/tgn/7002445
spatial: England
scope note: A positive black and white image on film which can be projected onto a screen when light is shone through it.

Colour Negative
type: Concept
broader: Photographic Medium
in scheme: FISH Resource Description Thesaurus
issued: 2024-09-19T12:28:53
license: https://www.nationalarchives.gov.uk/doc/open-government-licence/version/3/
attribution URL: https://historicengland.org.uk/
attribution name: Historic England
publisher: historicengland.org.uk
spatial: http://vocab.getty.edu/tgn/7002445
spatial: England
scope note: A photographic frame of developed colour film which can be used to print a photographic image.

Black And White Negative
type: Concept
broader: Photographic Medium
in scheme: FISH Resource Description Thesaurus
issued: 2024-09-19T12:28:53
license: https://www.nationalarchives.gov.uk/doc/open-government-licence/version/3/
attribution URL: https://historicengland.org.uk/
attribution name: Historic England
publisher: historicengland.org.uk
spatial: http://vocab.getty.edu/tgn/7002445
spatial: England
scope note: A photographic frame of developed black and white film from which a positive print can be produced.

Microfiche
type: Concept
broader: Microform
in scheme: FISH Resource Description Thesaurus
issued: 2024-09-19T12:28:53
license: https://www.nationalarchives.gov.uk/doc/open-government-licence/version/3/
attribution URL: https://historicengland.org.uk/
attribution name: Historic England
publisher: historicengland.org.uk
spatial: http://vocab.getty.edu/tgn/7002445
spatial: England
scope note: A flexible, transparent sheet of film bearing a number of reduced images.

Microform
type: Concept
narrower: Microfiche
narrower: Microfilm
broader: Photographic Medium
in scheme: FISH Resource Description Thesaurus
issued: 2024-09-19T12:28:53
license: https://www.nationalarchives.gov.uk/doc/open-government-licence/version/3/
attribution URL: https://historicengland.org.uk/
attribution name: Historic England
publisher: historicengland.org.uk
spatial: http://vocab.getty.edu/tgn/7002445
spatial: England
scope note: A medium containing microphotographic images, usually reproduced on film, requiring magnification to render them readable.

Microfilm
type: Concept
broader: Microform
in scheme: FISH Resource Description Thesaurus
issued: 2024-09-19T12:28:53
license: https://www.nationalarchives.gov.uk/doc/open-government-licence/version/3/
attribution URL: https://historicengland.org.uk/
attribution name: Historic England
publisher: historicengland.org.uk
spatial: http://vocab.getty.edu/tgn/7002445
spatial: England
scope note: A film strip or roll containing reduced images.

Official Designation Notification
type: Concept
broader: Text
narrower: Statutory Designation Notification
narrower: Advisory Designation Notification
in scheme: FISH Resource Description Thesaurus
issued: 2024-09-19T12:28:53
license: https://www.nationalarchives.gov.uk/doc/open-government-licence/version/3/
attribution URL: https://historicengland.org.uk/
attribution name: Historic England
publisher: historicengland.org.uk
spatial: http://vocab.getty.edu/tgn/7002445
spatial: England
scope note: This term is appropriate to official notifications of a monument or area whether they are statutory or purely advisory. Where possible the specific document type should be indexed for example Scheduled Monument Notification.

Statutory Designation Notification
type: Concept
broader: Official Designation Notification
narrower: Scheduled Monument Notification
narrower: List Of Buildings
in scheme: FISH Resource Description Thesaurus
issued: 2024-09-19T12:28:53
license: https://www.nationalarchives.gov.uk/doc/open-government-licence/version/3/
attribution URL: https://historicengland.org.uk/
attribution name: Historic England
publisher: historicengland.org.uk
spatial: http://vocab.getty.edu/tgn/7002445
spatial: England
scope note: This class of documents confers statutory designation on the monuments listed within them. It usually is restricted to legally defined national or local notifications of designation.

Scheduled Monument Notification
type: Concept
broader: Statutory Designation Notification
in scheme: FISH Resource Description Thesaurus
issued: 2024-09-19T12:28:53
license: https://www.nationalarchives.gov.uk/doc/open-government-licence/version/3/
attribution URL: https://historicengland.org.uk/
attribution name: Historic England
publisher: historicengland.org.uk
spatial: http://vocab.getty.edu/tgn/7002445
spatial: England
scope note: Any notification, update or amendment relating to the scheduling of a monument. Usually includes description and a map showing the limit of the scheduling. It confers a statutory status and receipt is an acknowledgement of the scheduling.

List Of Buildings
type: Concept
broader: Statutory Designation Notification
in scheme: FISH Resource Description Thesaurus
issued: 2024-09-19T12:28:53
license: https://www.nationalarchives.gov.uk/doc/open-government-licence/version/3/
attribution URL: https://historicengland.org.uk/
attribution name: Historic England
publisher: historicengland.org.uk
spatial: http://vocab.getty.edu/tgn/7002445
spatial: England
scope note: A list of buildings of special architectural or historic interest. This list confers a statutory level of protection status to the buildings contained within it and usually includes a description of each building.

Advisory Designation Notification
type: Concept
broader: Official Designation Notification
narrower: Battlefields Register
narrower: Register Of Parks And Gardens
in scheme: FISH Resource Description Thesaurus
issued: 2024-09-19T12:28:53
license: https://www.nationalarchives.gov.uk/doc/open-government-licence/version/3/
attribution URL: https://historicengland.org.uk/
attribution name: Historic England
publisher: historicengland.org.uk
spatial: http://vocab.getty.edu/tgn/7002445
spatial: England
scope note: The contents of these documents do not confer any statutory designation on the monuments listed, they are purely advisory notifications for use within preserving the historic environment.

Battlefields Register
type: Concept
broader: Advisory Designation Notification
in scheme: FISH Resource Description Thesaurus
issued: 2024-09-19T12:28:53
license: https://www.nationalarchives.gov.uk/doc/open-government-licence/version/3/
attribution URL: https://historicengland.org.uk/
attribution name: Historic England
publisher: historicengland.org.uk
spatial: http://vocab.getty.edu/tgn/7002445
spatial: England
scope note: A list of English battlefields maintained by English Heritage. Inclusion in the document does not confer any statutory status. It lists and records the details of battlefields to preserve their nature and survival.

Register Of Parks And Gardens
type: Concept
broader: Advisory Designation Notification
in scheme: FISH Resource Description Thesaurus
issued: 2024-09-19T12:28:53
license: https://www.nationalarchives.gov.uk/doc/open-government-licence/version/3/
attribution URL: https://historicengland.org.uk/
attribution name: Historic England
publisher: historicengland.org.uk
spatial: http://vocab.getty.edu/tgn/7002445
spatial: England
scope note: A register which including sites retaining any evidence of pre-1750 layouts; significant evidence of pre-1820 layouts; good examples of the best gardens from 1820 to 1880; are good examples of the best gardens laid out after 1880 but before 1970.

Scientific Dating Report
type: Concept
broader: Archaeological Science Report
narrower: Dendrochronology Report
narrower: Radiocarbon Dating Report
in scheme: FISH Resource Description Thesaurus
issued: 2024-09-19T12:28:53
license: https://www.nationalarchives.gov.uk/doc/open-government-licence/version/3/
attribution URL: https://historicengland.org.uk/
attribution name: Historic England
publisher: historicengland.org.uk
spatial: http://vocab.getty.edu/tgn/7002445
spatial: England
scope note: A report that primarily details the results of attempts to assign a date to materials or deposits using scientific methods such as Palaeomagnetism, Dendrochronology or Radiocarbon Dating.

Archaeological Science Report
type: Concept
narrower: Scientific Dating Report
broader: Report
in scheme: FISH Resource Description Thesaurus
issued: 2024-09-19T12:28:53
license: https://www.nationalarchives.gov.uk/doc/open-government-licence/version/3/
attribution URL: https://historicengland.org.uk/
attribution name: Historic England
publisher: historicengland.org.uk
spatial: http://vocab.getty.edu/tgn/7002445
spatial: England
scope note: A report detailing the results of the application of scientific techniques to the analysis of archaeological materials.