Lockheed Vega
type: Concept
issued: 2019-07-18T10:15:51
attribution name: Historic England
scope note: A subsidiary of Lockheed.
in scheme: First World War Project
attribution URL: http://www.historicengland.org.uk
license: http://creativecommons.org/licenses/by/3.0
publisher: www.historicengland.org.uk

First World War Project
type: ConceptScheme
attribution name: Historic England
has top concept: Unassigned
has top concept: Agriculture And Subsistence
attribution URL: http://www.historicengland.org.uk
publisher: www.historicengland.org.uk
has top concept: Aircraft Type
issued: 2019-07-18
has top concept: Commemorative
description: For the recording of monuments related to the First World War in the UK. This thesaurus was constructed for the First World War Home Front Project and does not contain any additional terminology than that held in Monument Type.
has top concept: Military Defence And Fortification
has top concept: Industrial
license: http://creativecommons.org/licenses/by/3.0

Armstrong Whitworth FK8
type: Concept
license: http://creativecommons.org/licenses/by/3.0
attribution name: Historic England
broader: Reconnaissance
alternative label: Fk8
attribution URL: http://www.historicengland.org.uk
broader: Bomber
issued: 2019-07-18T10:15:51
publisher: www.historicengland.org.uk
in scheme: First World War Project
broader: Armstrong Whitworth
scope note: Single-engine, two-seat tractor bomber and reconnaissance aircraft. Entered service in 1916 and, during 1917 and 1918, equipped nine RFC squadrons in its reconnaissance role.
broader: Biplane

Reconnaissance
type: Concept
license: http://creativecommons.org/licenses/by/3.0
narrower: Armstrong Whitworth FK3
broader: Aircraft <By Function>
publisher: www.historicengland.org.uk
narrower: Armstrong Whitworth FK8
issued: 2019-07-18T10:15:51
narrower: Bristol F2B
attribution URL: http://www.historicengland.org.uk
attribution name: Historic England
narrower: Airco DH6
in scheme: First World War Project
scope note: An aircraft, often fitted with cameras, intended to fly over enemy territory to ascertain its strategic features and/or the position and strength of any military presence.
narrower: Photo Reconnaissance

Bomber
type: Concept
attribution URL: http://www.historicengland.org.uk
scope note: A large, powerful aircraft, usually with two or more engines, designed to carry a payload of bombs.
narrower: Airco DH4
issued: 2019-07-18T10:15:51
narrower: Heavy Bomber
broader: Aircraft <By Function>
narrower: Torpedo Bomber
narrower: Light Bomber
in scheme: First World War Project
attribution name: Historic England
license: http://creativecommons.org/licenses/by/3.0
narrower: Armstrong Whitworth FK8
narrower: Medium Bomber
narrower: Fighter Bomber
narrower: Airco DH9
publisher: www.historicengland.org.uk

Armstrong Whitworth
type: Concept
publisher: www.historicengland.org.uk
in scheme: First World War Project
license: http://creativecommons.org/licenses/by/3.0
attribution URL: http://www.historicengland.org.uk
broader: Aircraft <By Manufacturer>
narrower: Armstrong Whitworth FK3
issued: 2019-07-18T10:15:51
attribution name: Historic England
scope note: Sir W. G. Armstrong Whitworth Aircraft, Ltd. formed in 1912.
narrower: Armstrong Whitworth FK8

Biplane
type: Concept
scope note: An aeroplane with two wings, or planes, placed one above the other either side of the fuselage.
license: http://creativecommons.org/licenses/by/3.0
narrower: Armstrong Whitworth FK3
narrower: Vimy
narrower: Airco DH4
publisher: www.historicengland.org.uk
narrower: Bristol F2B
issued: 2019-07-18T10:15:51
narrower: Avro 504
narrower: Airco DH1
narrower: Armstrong Whitworth FK8
attribution URL: http://www.historicengland.org.uk
narrower: Airco DH2
in scheme: First World War Project
narrower: Camel
narrower: Airco DH6
narrower: Gotha Gv
narrower: Snipe
narrower: Bleriot 155
narrower: Airco DH5
narrower: V1500
attribution name: Historic England
broader: Aircraft <By Form>

Wreck
type: Concept
license: http://creativecommons.org/licenses/by/3.0
attribution name: Historic England
issued: 2019-07-18T10:15:51
in scheme: First World War Project
broader: Unassigned
scope note: The remains of a vessel which has either sunk or suffered structural damage to the extent where it can no longer function.
publisher: www.historicengland.org.uk
attribution URL: http://www.historicengland.org.uk

Unassigned
type: Concept
issued: 2019-07-18T10:15:51
narrower: Bomb Site
publisher: www.historicengland.org.uk
attribution URL: http://www.historicengland.org.uk
narrower: Wreck
narrower: Sign
top concept of: First World War Project
attribution name: Historic England
license: http://creativecommons.org/licenses/by/3.0
in scheme: First World War Project

Aircraft Engine Factory
type: Concept
scope note: A factory where aircraft engines are assembled.
license: http://creativecommons.org/licenses/by/3.0
related: Aircraft Factory
attribution URL: http://www.historicengland.org.uk
broader: Aircraft Engineering Site
publisher: www.historicengland.org.uk
attribution name: Historic England
issued: 2019-07-18T10:15:51
in scheme: First World War Project

Aircraft Factory
type: Concept
publisher: www.historicengland.org.uk
scope note: A factory where aircraft are assembled.
alternative label: Aircraft Works
attribution name: Historic England
issued: 2019-07-18T10:15:51
broader: Vehicle Factory
in scheme: First World War Project
license: http://creativecommons.org/licenses/by/3.0
alternative label: Aircraft Assembly Plant
narrower: Seaplane Factory
related: Aircraft Engine Factory
broader: Aircraft Engineering Site
attribution URL: http://www.historicengland.org.uk

Aircraft Engineering Site
type: Concept
narrower: Balloon Shed
publisher: www.historicengland.org.uk
issued: 2019-07-18T10:15:51
attribution name: Historic England
in scheme: First World War Project
license: http://creativecommons.org/licenses/by/3.0
narrower: Airship Construction Works
narrower: Aircraft Factory
narrower: Aircraft Engine Factory
broader: Vehicle Engineering Site
narrower: Aircraft Testing Site
scope note: Sites used for the manufacture of aircraft.
attribution URL: http://www.historicengland.org.uk

Glaze And Reel House
type: Concept
in scheme: First World War Project
license: http://creativecommons.org/licenses/by/3.0
broader: Gunpowder Manufacturing Site
attribution URL: http://www.historicengland.org.uk
attribution name: Historic England
issued: 2019-07-18T10:15:51
scope note: A building containing equipment used for the polishing of grains of gunpowder and extraction of the resulting dust.
publisher: www.historicengland.org.uk

Gunpowder Manufacturing Site
type: Concept
narrower: Glaze And Reel House
in scheme: First World War Project
narrower: Corning House
narrower: Saltpetre Works
narrower: Incorporating Mill
scope note: Buildings, sites and structures associated with the production, testing and storage of gunpowder.
narrower: Gunpowder Drying House
narrower: Saltpetre Store
attribution URL: http://www.historicengland.org.uk
broader: Explosives Manufacturing Site
narrower: Press House
narrower: Nitre Bed
narrower: Gunpowder Works
publisher: www.historicengland.org.uk
attribution name: Historic England
issued: 2019-07-18T10:15:51
license: http://creativecommons.org/licenses/by/3.0

Bleriot
type: Concept
publisher: www.historicengland.org.uk
license: http://creativecommons.org/licenses/by/3.0
scope note: A French aircraft manufacturer founded by Louis Bleriot and Gabriel Voisin, both aviators and inventors, in 1903, dissolved in 1906. After the First World War Bleriot founded Bleriot Aeronautique developing commercial aircraft.
attribution URL: http://www.historicengland.org.uk
broader: Aircraft <By Manufacturer>
in scheme: First World War Project
alternative label: Bleriot Aeronautique
issued: 2019-07-18T10:15:51
attribution name: Historic England
narrower: Bleriot 155

Aircraft <By Manufacturer>
type: Concept
narrower: Handly Page
narrower: Fokker
publisher: www.historicengland.org.uk
issued: 2019-07-18T10:15:51
narrower: General Aircraft
narrower: Felixstowe
narrower: Sopwith
narrower: Armstrong Whitworth
narrower: Blackburn
attribution name: Historic England
narrower: Bristol
narrower: Vickers Armstrongs
in scheme: First World War Project
broader: Aircraft Type
narrower: Nieuport
narrower: Avro
narrower: Bleriot
narrower: De Havilland
narrower: Airco
license: http://creativecommons.org/licenses/by/3.0
attribution URL: http://www.historicengland.org.uk
narrower: Gotha

Bleriot 155
type: Concept
publisher: www.historicengland.org.uk
attribution name: Historic England
issued: 2019-07-18T10:15:51
in scheme: First World War Project
broader: Biplane
scope note: A French airliner produced in 1925. A fourengined biplane developed from the Bleriot 115 and 135 but larger than these. Two were built for Air Union (the Paris-London route). Both crashed with fatalaties in 1926 (Kent).
broader: Bleriot
broader: Transporter
license: http://creativecommons.org/licenses/by/3.0
attribution URL: http://www.historicengland.org.uk

Torpedo Station
type: Concept
attribution URL: http://www.historicengland.org.uk
issued: 2019-07-18T10:15:51
attribution name: Historic England
publisher: www.historicengland.org.uk
scope note: A land based establishment armed with torpedoes and used to defend the coast from enemy shipping.
license: http://creativecommons.org/licenses/by/3.0
broader: Coastal Defence Site
in scheme: First World War Project

Coastal Defence Site
type: Concept
narrower: Beach Defence Light
narrower: Torpedo Station
in scheme: First World War Project
narrower: Coastal Observation Post
narrower: Coastal Battery
broader: Defence Site
narrower: Minefield
narrower: Coast Artillery Searchlight
license: http://creativecommons.org/licenses/by/3.0
attribution URL: http://www.historicengland.org.uk
scope note: A defence site used to defend against emeny shipping or invasion attempts. Use more specific term.
publisher: www.historicengland.org.uk
issued: 2019-07-18T10:15:51
narrower: Extended Defence Officers Post
narrower: Boom Defence
narrower: Submarine Mine Establishment
narrower: Coastal Fort
attribution name: Historic England

Army Camp
type: Concept
issued: 2019-07-18T10:15:51
attribution URL: http://www.historicengland.org.uk
attribution name: Historic England
scope note: A site, including barracks and ancillary buildings used for the accommodation of soldiers.
in scheme: First World War Project
broader: Military Camp
license: http://creativecommons.org/licenses/by/3.0
publisher: www.historicengland.org.uk

Military Camp
type: Concept
scope note: A site where a body of troops is temporarily or permanently lodged, with or without entrenchments and fortifications.
narrower: Canadian Forestry Corps Camp
narrower: Training Camp
license: http://creativecommons.org/licenses/by/3.0
publisher: www.historicengland.org.uk
attribution name: Historic England
in scheme: First World War Project
issued: 2019-07-18T10:15:51
narrower: Womens Royal Air Force Camp
narrower: Army Camp
attribution URL: http://www.historicengland.org.uk
broader: Military Defence And Fortification

Transport Site
type: Concept
in scheme: First World War Project
attribution URL: http://www.historicengland.org.uk
license: http://creativecommons.org/licenses/by/3.0
broader: Military Defence And Fortification
publisher: www.historicengland.org.uk
issued: 2019-07-18T10:15:51
narrower: Airfield Site
attribution name: Historic England
scope note: A site associated with transport including both vehicles and transport infrastructure.
narrower: Bridge
narrower: Road

Military Defence And Fortification
type: Concept
narrower: Admiralty Signal Station
narrower: Hospital
narrower: Displaced Persons Camp
top concept of: First World War Project
issued: 2019-07-18T10:15:51
narrower: Headquarters
narrower: Domestic Site
narrower: Transport Site
narrower: Military Site
narrower: Military Building
narrower: Military Camp
publisher: www.historicengland.org.uk
narrower: First Aid Post
narrower: Royal Navy Shore Establishment
license: http://creativecommons.org/licenses/by/3.0
attribution name: Historic England
narrower: Prisoner Of War Camp
narrower: Embarkation Point
attribution URL: http://www.historicengland.org.uk
narrower: Airship Station
narrower: Training Site
narrower: Emergency Food Centre
narrower: Bomb Crater
in scheme: First World War Project
narrower: Military Base
narrower: Defence Site
narrower: Ministry Of Munitions Factory
narrower: Bombing Range Marker
narrower: Admiralty Signal Establishment
scope note: This is the top term for the thesaurus see Class List for Narrower Terms.
narrower: Requisitioned Land

Airfield Site
type: Concept
in scheme: First World War Project
narrower: Aircraft Storage Facility
narrower: Storage Facility
attribution name: Historic England
issued: 2019-07-18T10:15:51
narrower: Power Generation Site
publisher: www.historicengland.org.uk
attribution URL: http://www.historicengland.org.uk
license: http://creativecommons.org/licenses/by/3.0
scope note: A site, usually including hangars, runway and ancillary buildings, used for the storage, maintenance and take off and landing of aircraft.
narrower: Airfield
narrower: Technical And Instructional Site
broader: Transport Site
narrower: Control Tower

Bridge
type: Concept
license: http://creativecommons.org/licenses/by/3.0
attribution URL: http://www.historicengland.org.uk
in scheme: First World War Project
broader: Transport Site
issued: 2019-07-18T10:15:51
attribution name: Historic England
publisher: www.historicengland.org.uk
scope note: A structure of wood, stone, iron, brick or concrete, etc, with one or more intervals under it to span a river or other space. Use specific type where known.

Road
type: Concept
issued: 2019-07-18T10:15:51
attribution name: Historic England
broader: Transport Site
scope note: A way between different places, used by horses, travellers on foot and vehicles.
in scheme: First World War Project
attribution URL: http://www.historicengland.org.uk
license: http://creativecommons.org/licenses/by/3.0
publisher: www.historicengland.org.uk

Operations Room
type: Concept
publisher: www.historicengland.org.uk
broader: Technical And Instructional Site
in scheme: First World War Project
scope note: A room used for directing military operations and exercises.
issued: 2019-07-18T10:15:51
license: http://creativecommons.org/licenses/by/3.0
attribution name: Historic England
attribution URL: http://www.historicengland.org.uk

Technical And Instructional Site
type: Concept
narrower: Technical Site
broader: Airfield Site
narrower: Operations Room
license: http://creativecommons.org/licenses/by/3.0
publisher: www.historicengland.org.uk
narrower: Motor Transport Building
attribution URL: http://www.historicengland.org.uk
in scheme: First World War Project
scope note: Sites used for the maintenance of military equipment and buildings and the instruction of military personnel. Use more specific term.
narrower: Operations Block
attribution name: Historic England
narrower: Aeroplane Repair Section Shed
issued: 2019-07-18T10:15:51
narrower: Fire Tender House
narrower: Instructional Site

Commemorative
type: Concept
narrower: Commemorative Monument
issued: 2019-07-18T10:15:51
attribution name: Historic England
publisher: www.historicengland.org.uk
top concept of: First World War Project
narrower: Historical Site
license: http://creativecommons.org/licenses/by/3.0
narrower: Battlefield
attribution URL: http://www.historicengland.org.uk
in scheme: First World War Project

Commemorative Monument
type: Concept
issued: 2019-07-18T10:15:51
alternative label: Monument
alternative label: Commemorative Tablet
alternative label: Commemorative Arch
alternative label: Ceremonial Arch
narrower: Grave Marker
scope note: A building or structure erected to commemorate a person or event.
alternative label: Hall Of Memory
alternative label: Monumental Arch
narrower: Trophy
narrower: Cenotaph
alternative label: Memorial Chapel
narrower: Wall Monument
attribution URL: http://www.historicengland.org.uk
narrower: Named Tree
narrower: Animal Memorial
narrower: Commemorative Stone
in scheme: First World War Project
narrower: War Memorial
alternative label: Memorial
narrower: Effigy
narrower: Rostral Column
attribution name: Historic England
narrower: Coat Of Arms
narrower: Triumphal Arch
publisher: www.historicengland.org.uk
alternative label: Commemorative Column
license: http://creativecommons.org/licenses/by/3.0
narrower: Plaque
alternative label: Memorial Seat
alternative label: Memorial Garden
broader: Commemorative

Historical Site
type: Concept
in scheme: First World War Project
related: Battlefield
issued: 2019-07-18T10:15:51
broader: Commemorative
related: Named Tree
scope note: Site with important historical association.
attribution URL: http://www.historicengland.org.uk
license: http://creativecommons.org/licenses/by/3.0
attribution name: Historic England
publisher: www.historicengland.org.uk

Battlefield
type: Concept
attribution URL: http://www.historicengland.org.uk
broader: Commemorative
attribution name: Historic England
issued: 2019-07-18T10:15:51
license: http://creativecommons.org/licenses/by/3.0
in scheme: First World War Project
related: Historical Site
publisher: www.historicengland.org.uk
narrower: Naval Battlefield
scope note: The field or area of ground on which a battle or skirmish was fought.

Airco DH5
type: Concept
publisher: www.historicengland.org.uk
license: http://creativecommons.org/licenses/by/3.0
broader: Biplane
alternative label: Dh5
in scheme: First World War Project
attribution name: Historic England
attribution URL: http://www.historicengland.org.uk
broader: Airco
scope note: The DH5 was an attempt to give a tractor-type fighter a good forward view. However it suffered from unpleasant flying characteristics and, as a result, had a short service career.
broader: Fighter
issued: 2019-07-18T10:15:51

Airco
type: Concept
scope note: Aircraft Manufacturing Co., Ltd. Established in 1912 by Mr G. Holt Thomas. In 1914 secured the services of Capt. Geoffrey de Havilland as designer-in-chief, who went on to lend his initials to a number of highly successful machines.
narrower: Airco DH2
narrower: Airco DH6
broader: Aircraft <By Manufacturer>
attribution name: Historic England
license: http://creativecommons.org/licenses/by/3.0
narrower: Airco DH5
narrower: Airco DH9
publisher: www.historicengland.org.uk
attribution URL: http://www.historicengland.org.uk
narrower: Airco DH4
issued: 2019-07-18T10:15:51
narrower: Airco DH1
in scheme: First World War Project

Fighter
type: Concept
narrower: Airco DH1
narrower: Fighter Bomber
scope note: A light, high-speed aircraft designed to engage in aerial combat.
broader: Aircraft <By Function>
narrower: Bristol F2B
attribution name: Historic England
issued: 2019-07-18T10:15:51
in scheme: First World War Project
narrower: Airco DH5
license: http://creativecommons.org/licenses/by/3.0
narrower: Nightfighter
attribution URL: http://www.historicengland.org.uk
publisher: www.historicengland.org.uk
narrower: Snipe
narrower: Airco DH2
narrower: Camel

Royal Naval Air Station
type: Concept
attribution URL: http://www.historicengland.org.uk
issued: 2019-07-18T10:15:51
attribution name: Historic England
publisher: www.historicengland.org.uk
broader: Military Site
license: http://creativecommons.org/licenses/by/3.0
scope note: An airfield with associated hangars and control buildings used for the storage, maintenance and deployment of military aircraft and airships flown by the Royal Naval Air Service.
in scheme: First World War Project

Military Site
type: Concept
narrower: Seaplane Station
license: http://creativecommons.org/licenses/by/3.0
attribution name: Historic England
narrower: Royal Naval Air Station
in scheme: First World War Project
broader: Military Defence And Fortification
issued: 2019-07-18T10:15:51
publisher: www.historicengland.org.uk
narrower: Camouflage
scope note: Sites, buildings and structures used by the military.
attribution URL: http://www.historicengland.org.uk

Bristol F2B
type: Concept
issued: 2019-07-18T10:15:51
license: http://creativecommons.org/licenses/by/3.0
scope note: Highly successful, two-seat, biplane fighter and reconnaissance aircraft with both forward and rear facing guns. Designed to replace the BE2, it entered service with the RFC in mid-1917 and remained in service until 1932.
broader: Biplane
attribution name: Historic England
broader: Reconnaissance
broader: Bristol
in scheme: First World War Project
attribution URL: http://www.historicengland.org.uk
broader: Fighter
publisher: www.historicengland.org.uk

Bristol
type: Concept
publisher: www.historicengland.org.uk
narrower: Bristol F2B
in scheme: First World War Project
issued: 2019-07-18T10:15:51
attribution URL: http://www.historicengland.org.uk
scope note: The Bristol Aeroplane Co., Ltd.. Founded in 1910 by Sir George White, a pioneer of electric tramways. The company had previously been The British and Colonial Aeroplane Co., Ltd.
license: http://creativecommons.org/licenses/by/3.0
attribution name: Historic England
broader: Aircraft <By Manufacturer>

Radio Telegraphy Station
type: Concept
attribution URL: http://www.historicengland.org.uk
in scheme: First World War Project
broader: Radio Station
narrower: Radio Telegraphy Mast
issued: 2019-07-18T10:15:51
license: http://creativecommons.org/licenses/by/3.0
attribution name: Historic England
publisher: www.historicengland.org.uk
scope note: A building or group of buildings, incorporating radio masts, built to intercept radio transmissions from enemy vessels and aircraft during WWI.
narrower: Z Station
alternative label: Wireless Telegraphy Station
narrower: Y Station

Radio Station
type: Concept
in scheme: First World War Project
narrower: Radio Telegraphy Station
attribution name: Historic England
issued: 2019-07-18T10:15:51
publisher: www.historicengland.org.uk
attribution URL: http://www.historicengland.org.uk
license: http://creativecommons.org/licenses/by/3.0
alternative label: Wireless Station
broader: Communications Building
narrower: Radio Mast
scope note: A building or group of buildings containing equipment capable of transmitting and receiving radio signals. Use BROADCASTING RADIO STATION for broadcasting establishments e.g. BFBS Radio stations.

Radio Telegraphy Mast
type: Concept
attribution name: Historic England
license: http://creativecommons.org/licenses/by/3.0
broader: Radio Telegraphy Station
issued: 2019-07-18T10:15:51
in scheme: First World War Project
publisher: www.historicengland.org.uk
scope note: A tall, usually steel, structure used to receive and transmit radio telegraphy signals.
attribution URL: http://www.historicengland.org.uk

Z Station
type: Concept
license: http://creativecommons.org/licenses/by/3.0
broader: Radio Telegraphy Station
attribution URL: http://www.historicengland.org.uk
in scheme: First World War Project
publisher: www.historicengland.org.uk
issued: 2019-07-18T10:15:51
attribution name: Historic England

Y Station
type: Concept
in scheme: First World War Project
attribution name: Historic England
issued: 2019-07-18T10:15:51
publisher: www.historicengland.org.uk
license: http://creativecommons.org/licenses/by/3.0
attribution URL: http://www.historicengland.org.uk
broader: Radio Telegraphy Station

Nitroglycerine Works
type: Concept
issued: 2019-07-18T10:15:51
license: http://creativecommons.org/licenses/by/3.0
attribution name: Historic England
scope note: A works or factory where nitroglycerine is manufactured.
broader: Explosives Factory
attribution URL: http://www.historicengland.org.uk
publisher: www.historicengland.org.uk
in scheme: First World War Project

Explosives Factory
type: Concept
narrower: Gelatine Works (Explosive)
narrower: Trinitrotoluene Factory
in scheme: First World War Project
scope note: A building or buildings where explosives are manufactured.
broader: Factory
narrower: Gelignite Works
alternative label: Explosives Works
narrower: Guncotton Factory
license: http://creativecommons.org/licenses/by/3.0
narrower: Ammonium Nitrate Works
narrower: Ammonium Perchlorate Works
issued: 2019-07-18T10:15:51
broader: Explosives Manufacturing Site
narrower: Dynamite Factory
publisher: www.historicengland.org.uk
narrower: Nitroglycerine Works
narrower: Picric Acid Works
narrower: Ammonal Works
narrower: Sabulite Factory
narrower: Bellite Works
narrower: Toluene Works
narrower: Nitrocellulose Powder Factory
narrower: Cordite Factory
attribution name: Historic England
narrower: Saltpetre Works
attribution URL: http://www.historicengland.org.uk
narrower: Phenol Works

Agriculture And Subsistence
type: Concept
license: http://creativecommons.org/licenses/by/3.0
attribution name: Historic England
in scheme: First World War Project
narrower: Piggery
top concept of: First World War Project
narrower: Farm
publisher: www.historicengland.org.uk
issued: 2019-07-18T10:15:51
narrower: Requisitioned Land
narrower: Allotment
attribution URL: http://www.historicengland.org.uk

Piggery
type: Concept
in scheme: First World War Project
attribution URL: http://www.historicengland.org.uk
license: http://creativecommons.org/licenses/by/3.0
issued: 2019-07-18T10:15:51
scope note: A place where pigs are reared.
broader: Agriculture And Subsistence
attribution name: Historic England
publisher: www.historicengland.org.uk

Farm
type: Concept
broader: Agriculture And Subsistence
attribution name: Historic England
issued: 2019-07-18T10:15:51
in scheme: First World War Project
publisher: www.historicengland.org.uk
attribution URL: http://www.historicengland.org.uk
license: http://creativecommons.org/licenses/by/3.0
scope note: A tract of land, often including a farmhouse and ancillary buildings, used for the purpose of cultivation and the rearing of livestock, etc.

Requisitioned Land
type: Concept
issued: 2019-07-18T10:15:51
broader: Agriculture And Subsistence
attribution name: Historic England
in scheme: First World War Project
related: Requisitioned Building
related: Training Area
attribution URL: http://www.historicengland.org.uk
license: http://creativecommons.org/licenses/by/3.0
broader: Military Defence And Fortification
scope note: Land which has been temporarily taken over for use by the military or civilian authorities. During wartime land was requisitioned for various purposes, such as for argriculture or for military training/events etc.
publisher: www.historicengland.org.uk

Allotment
type: Concept
license: http://creativecommons.org/licenses/by/3.0
scope note: A share or portion of land, allotted to a person, often used for growing, vegetables, fruit, etc.
attribution URL: http://www.historicengland.org.uk
in scheme: First World War Project
publisher: www.historicengland.org.uk
broader: Agriculture And Subsistence
issued: 2019-07-18T10:15:51
attribution name: Historic England

Barbed Wire Entanglement
type: Concept
issued: 2019-07-18T10:15:51
attribution URL: http://www.historicengland.org.uk
attribution name: Historic England
in scheme: First World War Project
scope note: One or more coils of barbed wire intended to impede the advance of hostile troops.
license: http://creativecommons.org/licenses/by/3.0
broader: Anti Invasion Defence Site
publisher: www.historicengland.org.uk

Anti Invasion Defence Site
type: Concept
narrower: Barbed Wire Entanglement
attribution name: Historic England
attribution URL: http://www.historicengland.org.uk
publisher: www.historicengland.org.uk
scope note: Sites, buildings and structures associated with the defence of the British Isles against invasion from seaborne or airborne forces.
narrower: Gun Emplacement
issued: 2019-07-18T10:15:51
in scheme: First World War Project
narrower: Anti Submarine Defence
narrower: Pillbox
narrower: Fieldwork
broader: Defence Site
license: http://creativecommons.org/licenses/by/3.0

MkX
type: Concept
attribution name: Historic England
broader: Aircraft Mark
scope note: Mark 10 or the tenth variant of an aircraft with its associated modifications.
issued: 2019-07-18T10:15:51
attribution URL: http://www.historicengland.org.uk
publisher: www.historicengland.org.uk
in scheme: First World War Project
license: http://creativecommons.org/licenses/by/3.0

Aircraft Mark
type: Concept
narrower: MkVIII
broader: Aircraft Type
narrower: MkIC
narrower: MkVII
attribution name: Historic England
narrower: MkVB
narrower: MkXI
scope note: Used to identify the variations of an aircraft. Index with Manufacturer, Form and Function.
narrower: MkIF
narrower: MkVI
narrower: MkXIV
narrower: MkIIIA
narrower: MkIIC
license: http://creativecommons.org/licenses/by/3.0
narrower: MkV
narrower: MkI
narrower: MkIIA
narrower: MkIII
narrower: MkVIC
narrower: MkIV
narrower: MkII
narrower: MkX
in scheme: First World War Project
narrower: MkXVI
publisher: www.historicengland.org.uk
attribution URL: http://www.historicengland.org.uk
narrower: MkIIB
issued: 2019-07-18T10:15:51
narrower: MkXII

Emergency Coast Defence Battery
type: Concept
publisher: www.historicengland.org.uk
attribution name: Historic England
issued: 2019-07-18T10:15:51
attribution URL: http://www.historicengland.org.uk
license: http://creativecommons.org/licenses/by/3.0
scope note: A coastal battery constructed at short notice usually mounting a variety of artillery pieces.
broader: Coast Artillery Battery
in scheme: First World War Project

Coast Artillery Battery
type: Concept
in scheme: First World War Project
license: http://creativecommons.org/licenses/by/3.0
scope note: A defensive battery positioned facing out to sea enabling the guns to be brought to bear on enemy shipping and amphibious craft.
narrower: Anti Motor Torpedo Boat Battery
attribution URL: http://www.historicengland.org.uk
broader: Coastal Battery
attribution name: Historic England
issued: 2019-07-18T10:15:51
narrower: Emergency Coast Defence Battery
narrower: Close Defence Battery
publisher: www.historicengland.org.uk

Plaque
type: Concept
attribution name: Historic England
related: Date Stone
attribution URL: http://www.historicengland.org.uk
alternative label: Commemorative Tablet
publisher: www.historicengland.org.uk
alternative label: Brass Plaque
alternative label: Wall Tablet
scope note: An ornamental, commemorative tablet.
issued: 2019-07-18T10:15:51
alternative label: Bread Stone
alternative label: Commemorative Plaque
in scheme: First World War Project
broader: Commemorative Monument
alternative label: Bronze Plaque
license: http://creativecommons.org/licenses/by/3.0

Date Stone
type: Concept
broader: Commemorative Stone
scope note: A stone commemorating the date of a specific event.
attribution URL: http://www.historicengland.org.uk
in scheme: First World War Project
related: Plaque
issued: 2019-07-18T10:15:51
license: http://creativecommons.org/licenses/by/3.0
attribution name: Historic England
publisher: www.historicengland.org.uk

MkXII
type: Concept
attribution URL: http://www.historicengland.org.uk
broader: Aircraft Mark
issued: 2019-07-18T10:15:51
scope note: Mark 12 or the twelfth variant of an aircraft with its associated modifications.
attribution name: Historic England
license: http://creativecommons.org/licenses/by/3.0
in scheme: First World War Project
publisher: www.historicengland.org.uk

Carriage Works
type: Concept
scope note: A building or works in which carriages were built. Use RAILWAY CARRIAGE WORKS for sites making railway carriages.
license: http://creativecommons.org/licenses/by/3.0
broader: Motor Vehicle Engineering Site
attribution URL: http://www.historicengland.org.uk
in scheme: First World War Project
issued: 2019-07-18T10:15:51
attribution name: Historic England
publisher: www.historicengland.org.uk
broader: Engineering Works

Motor Vehicle Engineering Site
type: Concept
in scheme: First World War Project
narrower: Motor Cycle Factory
narrower: Car Factory
narrower: Lorry Factory
narrower: Coach Works
issued: 2019-07-18T10:15:51
license: http://creativecommons.org/licenses/by/3.0
scope note: Buildings and sites associated with the manufacture of motor vehicles.
attribution URL: http://www.historicengland.org.uk
publisher: www.historicengland.org.uk
narrower: Carriage Works
broader: Vehicle Engineering Site
attribution name: Historic England

Engineering Works
type: Concept
attribution URL: http://www.historicengland.org.uk
alternative label: Traction Engine Works
broader: Engineering Industry Site
alternative label: Engine Works
broader: Works
scope note: Any factory or site using machine tools in a manufacturing or processing capacity.
alternative label: Engine Manufactory
narrower: Coach Works
license: http://creativecommons.org/licenses/by/3.0
narrower: Carriage Works
in scheme: First World War Project
issued: 2019-07-18T10:15:51
attribution name: Historic England
publisher: www.historicengland.org.uk

Rifle Pit
type: Concept
attribution name: Historic England
license: http://creativecommons.org/licenses/by/3.0
in scheme: First World War Project
publisher: www.historicengland.org.uk
attribution URL: http://www.historicengland.org.uk
broader: Fieldwork
issued: 2019-07-18T10:15:51
scope note: A pit dug to protect a small group of infantry men.

Fieldwork
type: Concept
narrower: Rifle Pit
attribution name: Historic England
narrower: Infantry Post
issued: 2019-07-18T10:15:51
in scheme: First World War Project
publisher: www.historicengland.org.uk
attribution URL: http://www.historicengland.org.uk
scope note: A usually temporary earthwork or fortification, constructed by military forces operating in the field. Use more specific type where known.
license: http://creativecommons.org/licenses/by/3.0
narrower: Weapons Pit
narrower: Trench
broader: Anti Invasion Defence Site

Accommodation Hut
type: Concept
scope note: A hut used for the accommodation of members of the armed forces.
attribution URL: http://www.historicengland.org.uk
attribution name: Historic England
issued: 2019-07-18T10:15:51
license: http://creativecommons.org/licenses/by/3.0
in scheme: First World War Project
broader: Ancillary Building
publisher: www.historicengland.org.uk

Ancillary Building
type: Concept
attribution URL: http://www.historicengland.org.uk
license: http://creativecommons.org/licenses/by/3.0
narrower: Generator House
narrower: Official Residence
narrower: Airfield Building
narrower: Ammunition Store
narrower: Workshop
narrower: Barracks
broader: Defence Site
narrower: Observation Post
narrower: Ambulance Station
narrower: Recreation Hut
narrower: Requisitioned Building
scope note: Buildings, used for a variety of purposes, providing support to essential services or for a central function. Use more specific term.
narrower: Military Office
narrower: Mess
narrower: Barrack Block
narrower: Ablutions Block
narrower: Airmens Quarters
narrower: Billet
issued: 2019-07-18T10:15:51
narrower: Guardhouse
narrower: Communications Building
narrower: Blast Wall
narrower: Fire Station
in scheme: First World War Project
narrower: Quartermasters Store
narrower: Reception Centre
narrower: Accommodation Hut
narrower: Command Post
narrower: Engine House
narrower: Military Headquarters
narrower: Officers Quarters
attribution name: Historic England
narrower: Armoury
narrower: Regimental Headquarters
narrower: Nissen Hut
publisher: www.historicengland.org.uk

Trinitrotoluene Factory
type: Concept
scope note: A factory or works principally engaged in the refining or manufacture of TNT.
publisher: www.historicengland.org.uk
in scheme: First World War Project
attribution URL: http://www.historicengland.org.uk
issued: 2019-07-18T10:15:51
license: http://creativecommons.org/licenses/by/3.0
attribution name: Historic England
broader: Explosives Factory

Power House
type: Concept
narrower: Power House (476/18)
in scheme: First World War Project
narrower: Power House (207/17)
issued: 2019-07-18T10:15:51
attribution URL: http://www.historicengland.org.uk
license: http://creativecommons.org/licenses/by/3.0
attribution name: Historic England
publisher: www.historicengland.org.uk
scope note: Building for domestic or small scale unspecified power generation.
broader: Power Generation Site

Power House (476/18)
type: Concept
attribution name: Historic England
scope note: The standard RFC power house built to Air Ministry drawing number 476/18 and comprising an engine room with a small workshop and driver's room.
in scheme: First World War Project
publisher: www.historicengland.org.uk
broader: Power House
attribution URL: http://www.historicengland.org.uk
issued: 2019-07-18T10:15:51
license: http://creativecommons.org/licenses/by/3.0

Power House (207/17)
type: Concept
license: http://creativecommons.org/licenses/by/3.0
attribution URL: http://www.historicengland.org.uk
in scheme: First World War Project
broader: Power House
scope note: A power house built to Air Ministry drawing number 207/17 and comprising four rooms; a driver's room, workshop and store, battery room and engine room containing 2 generator sets.
issued: 2019-07-18T10:15:51
attribution name: Historic England
publisher: www.historicengland.org.uk

Power Generation Site
type: Concept
license: http://creativecommons.org/licenses/by/3.0
attribution URL: http://www.historicengland.org.uk
in scheme: First World War Project
narrower: Hydraulic Power Site
publisher: www.historicengland.org.uk
scope note: A site or building including generators and fuel storage facilities used to generate electricity.
broader: Industrial
broader: Airfield Site
narrower: Stand By Set House
narrower: Power House
issued: 2019-07-18T10:15:51
attribution name: Historic England

Auxiliary Hospital
type: Concept
publisher: www.historicengland.org.uk
narrower: Voluntary Aid Detachment Hospital
license: http://creativecommons.org/licenses/by/3.0
scope note: A building temporarily requistioned for use as a hospital. Auxiliary hospitals treated the less seriously wounded and were less strict than military hospitals although they remained under military control.
attribution URL: http://www.historicengland.org.uk
issued: 2019-07-18T10:15:51
attribution name: Historic England
in scheme: First World War Project
broader: Hospital

Voluntary Aid Detachment Hospital
type: Concept
issued: 2019-07-18T10:15:51
attribution URL: http://www.historicengland.org.uk
attribution name: Historic England
broader: Auxiliary Hospital
scope note: A building temporarily requisitioned for use as an auxiliary hospital administered by members of the Voluntary Aid Detachment during the First World War.
license: http://creativecommons.org/licenses/by/3.0
alternative label: Vad Hospital
publisher: www.historicengland.org.uk
in scheme: First World War Project

Hospital
type: Concept
issued: 2019-07-18T10:15:51
in scheme: First World War Project
broader: Military Defence And Fortification
scope note: A building for the medical and surgical treatment of both civilians and military personnel. Use narrower type if possible.
license: http://creativecommons.org/licenses/by/3.0
publisher: www.historicengland.org.uk
narrower: Auxiliary Hospital
attribution URL: http://www.historicengland.org.uk
narrower: Military Hospital
related: First Aid Post
attribution name: Historic England

Tank Park
type: Concept
attribution URL: http://www.historicengland.org.uk
broader: Vehicle Park
issued: 2019-07-18T10:15:51
attribution name: Historic England
license: http://creativecommons.org/licenses/by/3.0
in scheme: First World War Project
scope note: A site where tanks and armoured fighting vehicles can be stored.
publisher: www.historicengland.org.uk

Vehicle Park
type: Concept
publisher: www.historicengland.org.uk
license: http://creativecommons.org/licenses/by/3.0
narrower: Tank Park
broader: Storage Facility
attribution URL: http://www.historicengland.org.uk
scope note: A site, usually consisting of a simple open area of land or hardstanding and used for the storage of vehicles.
attribution name: Historic England
narrower: Ambulance Park
in scheme: First World War Project
issued: 2019-07-18T10:15:51

Works
type: Concept
attribution name: Historic England
narrower: Aircraft Maintenance Unit
in scheme: First World War Project
scope note: Usually a complex of buildings for the processing of raw materials. Use specific type where known.
broader: Industrial Building
publisher: www.historicengland.org.uk
narrower: Engineering Works
attribution URL: http://www.historicengland.org.uk
issued: 2019-07-18T10:15:51
license: http://creativecommons.org/licenses/by/3.0
narrower: Ship Repair Works

Aircraft Maintenance Unit
type: Concept
attribution URL: http://www.historicengland.org.uk
broader: Works
scope note: A site used for the maintenance of aircraft.
issued: 2019-07-18T10:15:51
in scheme: First World War Project
attribution name: Historic England
license: http://creativecommons.org/licenses/by/3.0
publisher: www.historicengland.org.uk

Industrial Building
type: Concept
in scheme: First World War Project
scope note: Any building designed or adapted to accommodate trades and manufacturing activity. Use more specific site where known.
attribution name: Historic England
issued: 2019-07-18T10:15:51
publisher: www.historicengland.org.uk
attribution URL: http://www.historicengland.org.uk
license: http://creativecommons.org/licenses/by/3.0
narrower: Works
narrower: Factory
broader: Industrial
narrower: Chimney

Ship Repair Works
type: Concept
broader: Marine Construction Site
license: http://creativecommons.org/licenses/by/3.0
scope note: A site containing slipways and associated buildings used specifically for the repair of ships and larger ocean-going craft.
related: Marine Engineering Works
in scheme: First World War Project
related: Dry Dock
broader: Works
publisher: www.historicengland.org.uk
attribution URL: http://www.historicengland.org.uk
issued: 2019-07-18T10:15:51
attribution name: Historic England

Military Base
type: Concept
scope note: A building or group of buildings, often surrounded by a system of fortifications, used as a residential and training site by members of an armed force.
narrower: Royal Naval Base
publisher: www.historicengland.org.uk
narrower: Air Sea Rescue Station
license: http://creativecommons.org/licenses/by/3.0
attribution name: Historic England
attribution URL: http://www.historicengland.org.uk
broader: Military Defence And Fortification
narrower: Training Base
in scheme: First World War Project
issued: 2019-07-18T10:15:51

Royal Naval Base
type: Concept
in scheme: First World War Project
broader: Military Base
attribution name: Historic England
issued: 2019-07-18T10:15:51
publisher: www.historicengland.org.uk
attribution URL: http://www.historicengland.org.uk
license: http://creativecommons.org/licenses/by/3.0
scope note: A site, usually with docks and control buildings, used for the storage, maintenance and deployment of military vessels or the administration of the Royal Navy. May also include accommodation buildings for personnel.

Air Sea Rescue Station
type: Concept
in scheme: First World War Project
broader: Military Base
attribution name: Historic England
issued: 2019-07-18T10:15:51
publisher: www.historicengland.org.uk
attribution URL: http://www.historicengland.org.uk
license: http://creativecommons.org/licenses/by/3.0
scope note: A site or building used to co-ordinate Air-Sea Rescue operations.

Training Base
type: Concept
broader: Training Site
issued: 2019-07-18T10:15:51
attribution name: Historic England
broader: Military Base
scope note: A military base used for training service personnel.
in scheme: First World War Project
attribution URL: http://www.historicengland.org.uk
license: http://creativecommons.org/licenses/by/3.0
publisher: www.historicengland.org.uk

Grave Marker
type: Concept
scope note: A stone, slate, iron or wooden structure used to mark the site of a grave.
license: http://creativecommons.org/licenses/by/3.0
attribution name: Historic England
issued: 2019-07-18T10:15:51
in scheme: First World War Project
publisher: www.historicengland.org.uk
broader: Commemorative Monument
attribution URL: http://www.historicengland.org.uk
narrower: Gravestone

Gravestone
type: Concept
attribution name: Historic England
in scheme: First World War Project
related: Commemorative Stone
broader: Grave Marker
publisher: www.historicengland.org.uk
alternative label: Ledger Stone
attribution URL: http://www.historicengland.org.uk
alternative label: Headstone
alternative label: Footstone
issued: 2019-07-18T10:15:51
license: http://creativecommons.org/licenses/by/3.0
scope note: A stone placed over or at the head or foot of a grave, or at the entrance of a tomb.

Mixing House
type: Concept
publisher: www.historicengland.org.uk
alternative label: Gunpowder Mixing House
license: http://creativecommons.org/licenses/by/3.0
in scheme: First World War Project
issued: 2019-07-18T10:15:51
scope note: A building in which the ingredients of an explosive charge are weighed into their correct proportions and mixed prior to incorporation.
attribution name: Historic England
attribution URL: http://www.historicengland.org.uk
broader: Explosives Manufacturing Site

Explosives Manufacturing Site
type: Concept
issued: 2019-07-18T10:15:51
narrower: Cordite Dough Store
narrower: Reel Drying Stove
narrower: Cartridge House
license: http://creativecommons.org/licenses/by/3.0
narrower: Cordite Incorporating House
attribution URL: http://www.historicengland.org.uk
narrower: Mixing House
broader: Industrial
narrower: Explosives Factory
in scheme: First World War Project
attribution name: Historic England
publisher: www.historicengland.org.uk
narrower: Gunpowder Manufacturing Site
scope note: Buildings, sites and structures associated with the production, testing and storage of explosives.
narrower: Match Lodge
narrower: Guncotton Stove
narrower: Testing Range
narrower: Wet Guncotton Magazine
narrower: Mineral Jelly Store
narrower: Charge House

Textile Industry Site
type: Concept
license: http://creativecommons.org/licenses/by/3.0
attribution name: Historic England
in scheme: First World War Project
narrower: Textile Mill
publisher: www.historicengland.org.uk
issued: 2019-07-18T10:15:51
broader: Industrial
scope note: Includes all stages of production process of textiles, eg. wool, cotton, linen, etc, and textile products. Use only for sites where there is evidence of textile manufacture but no specific monument type, otherwise use more specific term.
attribution URL: http://www.historicengland.org.uk

Textile Mill
type: Concept
attribution name: Historic England
attribution URL: http://www.historicengland.org.uk
publisher: www.historicengland.org.uk
in scheme: First World War Project
scope note: Any factory used for the manufacture of textiles.
broader: Textile Industry Site
issued: 2019-07-18T10:15:51
license: http://creativecommons.org/licenses/by/3.0

Industrial
type: Concept
narrower: Industrial Building
issued: 2019-07-18T10:15:51
license: http://creativecommons.org/licenses/by/3.0
attribution URL: http://www.historicengland.org.uk
narrower: Textile Industry Site
narrower: Marine Construction Site
attribution name: Historic England
publisher: www.historicengland.org.uk
narrower: Power Generation Site
narrower: Explosives Manufacturing Site
top concept of: First World War Project
narrower: Engineering Industry Site
narrower: Clothing Industry Site
in scheme: First World War Project
narrower: Armament Manufacturing Site

Arsenal
type: Concept
broader: Armament Manufacturing Site
issued: 2019-07-18T10:15:51
related: Cannon Boring Mill
in scheme: First World War Project
attribution URL: http://www.historicengland.org.uk
related: Ordnance Factory
publisher: www.historicengland.org.uk
alternative label: Naval Arsenal
license: http://creativecommons.org/licenses/by/3.0
attribution name: Historic England
scope note: A building or large scale site for the manufacture and/or storage of weapons, ammunition and equipment.

Armament Manufacturing Site
type: Concept
attribution name: Historic England
narrower: Munitions Factory
narrower: Proving House
issued: 2019-07-18T10:15:51
narrower: Cannon Boring Mill
publisher: www.historicengland.org.uk
narrower: Ordnance Factory
broader: Industrial
narrower: Cannon Foundry
license: http://creativecommons.org/licenses/by/3.0
in scheme: First World War Project
narrower: Arsenal
scope note: A building or site used for the manufacture, assembly and testing of weapons, explosives and associated military hardware.
narrower: Shot Tower
narrower: Gun Testing Shop
attribution URL: http://www.historicengland.org.uk

Cannon Boring Mill
type: Concept
broader: Armament Manufacturing Site
issued: 2019-07-18T10:15:51
in scheme: First World War Project
publisher: www.historicengland.org.uk
attribution URL: http://www.historicengland.org.uk
attribution name: Historic England
license: http://creativecommons.org/licenses/by/3.0
broader: Boring Mill
related: Arsenal
scope note: A building used for drilling out the bores of cannon and other military pieces.

Ordnance Factory
type: Concept
broader: Armament Manufacturing Site
alternative label: Rifle Factory
alternative label: Gun Factory
license: http://creativecommons.org/licenses/by/3.0
scope note: A building or site used for the manufacture of small arms and artillery pieces, etc.
related: Arsenal
attribution URL: http://www.historicengland.org.uk
in scheme: First World War Project
alternative label: Armaments Factory
issued: 2019-07-18T10:15:51
attribution name: Historic England
publisher: www.historicengland.org.uk
broader: Factory
alternative label: Small Arms Factory

Vickers Armstrongs
type: Concept
attribution URL: http://www.historicengland.org.uk
issued: 2019-07-18T10:15:51
license: http://creativecommons.org/licenses/by/3.0
attribution name: Historic England
broader: Aircraft <By Manufacturer>
in scheme: First World War Project
narrower: Vickers
publisher: www.historicengland.org.uk
scope note: Vickers-Armstrongs Ltd.. In 1938 took over Vickers (Aviation) Ltd., which itself had taken control of Supermarine Aviation Works Ltd. in 1928.

Vickers
type: Concept
attribution URL: http://www.historicengland.org.uk
license: http://creativecommons.org/licenses/by/3.0
broader: Vickers Armstrongs
publisher: www.historicengland.org.uk
in scheme: First World War Project
issued: 2019-07-18T10:15:51
attribution name: Historic England
narrower: Vimy
scope note: Vickers (Aviation) Ltd. formed in 1911, as the aviation division of Vickers Ltd., and took control of Supermarine Aviation Works Ltd. the same year. Taken over by Vickers-Armstrongs Ltd. in 1938.

Motor Cycle Factory
type: Concept
in scheme: First World War Project
attribution URL: http://www.historicengland.org.uk
license: http://creativecommons.org/licenses/by/3.0
scope note: A building where motor cycles are assembled.
broader: Motor Vehicle Engineering Site
broader: Vehicle Factory
attribution name: Historic England
issued: 2019-07-18T10:15:51
publisher: www.historicengland.org.uk

Vehicle Factory
type: Concept
narrower: Tank Factory
scope note: A factory for the manufacture of vehicles.
attribution name: Historic England
license: http://creativecommons.org/licenses/by/3.0
publisher: www.historicengland.org.uk
in scheme: First World War Project
attribution URL: http://www.historicengland.org.uk
broader: Factory
narrower: Lorry Factory
issued: 2019-07-18T10:15:51
narrower: Aircraft Factory
narrower: Motor Cycle Factory
narrower: Bicycle Factory
narrower: Car Factory

Cenotaph
type: Concept
attribution URL: http://www.historicengland.org.uk
in scheme: First World War Project
related: War Memorial
issued: 2019-07-18T10:15:51
broader: Commemorative Monument
scope note: A sepulchral monument erected to commemorate a person or persons buried elsewhere.
license: http://creativecommons.org/licenses/by/3.0
attribution name: Historic England
publisher: www.historicengland.org.uk

War Memorial
type: Concept
related: Cenotaph
attribution name: Historic England
issued: 2019-07-18T10:15:51
scope note: A structure, building or site commemorating soldiers and civilians killed in war.
alternative label: War Memorial Garden
publisher: www.historicengland.org.uk
in scheme: First World War Project
attribution URL: http://www.historicengland.org.uk
license: http://creativecommons.org/licenses/by/3.0
alternative label: War Memorial Cloister
alternative label: War Memorial Chapel
broader: Commemorative Monument

Coastal Battery
type: Concept
related: Battery Engine House
attribution name: Historic England
narrower: Coast Battery Gun Site
in scheme: First World War Project
license: http://creativecommons.org/licenses/by/3.0
scope note: A site including artillery pieces and associated structures directed out to sea to engage enemy shipping and defend the coastline. Use more specific term where known.
narrower: Coast Artillery Battery
issued: 2019-07-18T10:15:51
attribution URL: http://www.historicengland.org.uk
related: Coast Artillery Searchlight
publisher: www.historicengland.org.uk
narrower: Coastal Battery Command Post
broader: Coastal Defence Site
narrower: Battery Observation Post
narrower: Beach Defence Battery

Battery Engine House
type: Concept
license: http://creativecommons.org/licenses/by/3.0
attribution name: Historic England
related: Anti Aircraft Battery
broader: Engine House
related: Coastal Battery
scope note: A building housing the engines used to power equipment used by a searchlight, anti-aircraft or caostal battery.
publisher: www.historicengland.org.uk
related: Searchlight Battery
issued: 2019-07-18T10:15:51
in scheme: First World War Project
attribution URL: http://www.historicengland.org.uk

Coast Battery Gun Site
type: Concept
in scheme: First World War Project
license: http://creativecommons.org/licenses/by/3.0
publisher: www.historicengland.org.uk
scope note: A gun emplacement associated with a coastal battery.
issued: 2019-07-18T10:15:51
attribution URL: http://www.historicengland.org.uk
attribution name: Historic England
broader: Coastal Battery

Coast Artillery Searchlight
type: Concept
license: http://creativecommons.org/licenses/by/3.0
related: Coastal Battery
attribution URL: http://www.historicengland.org.uk
in scheme: First World War Project
publisher: www.historicengland.org.uk
broader: Coastal Defence Site
issued: 2019-07-18T10:15:51
scope note: A searchlight battery, which faces out to sea, used to locate and illuminate enemy shipping.
related: Beach Defence Light
attribution name: Historic England

Coastal Battery Command Post
type: Concept
broader: Coastal Battery
attribution name: Historic England
broader: Command Post
attribution URL: http://www.historicengland.org.uk
publisher: www.historicengland.org.uk
license: http://creativecommons.org/licenses/by/3.0
scope note: A command post used to direct the guns of a coastal battery.
issued: 2019-07-18T10:15:51
in scheme: First World War Project

Battery Observation Post
type: Concept
broader: Anti Aircraft Battery
attribution URL: http://www.historicengland.org.uk
broader: Coastal Battery
publisher: www.historicengland.org.uk
attribution name: Historic England
scope note: A building used to observe the movements of hostile aircraft or shipping.
issued: 2019-07-18T10:15:51
license: http://creativecommons.org/licenses/by/3.0
in scheme: First World War Project
broader: Observation Post
broader: Searchlight Battery

Beach Defence Battery
type: Concept
attribution URL: http://www.historicengland.org.uk
scope note: A battery, usually a single gun often in a pillbox, situated so as to provide enfilading fire along a beach to prevent hostile forces from advancing inland.
in scheme: First World War Project
broader: Coastal Battery
issued: 2019-07-18T10:15:51
license: http://creativecommons.org/licenses/by/3.0
attribution name: Historic England
publisher: www.historicengland.org.uk

Weapon Testing Facility
type: Concept
broader: Defence Site
issued: 2019-07-18T10:15:51
narrower: Firing Range
license: http://creativecommons.org/licenses/by/3.0
narrower: Bombing Range
attribution name: Historic England
attribution URL: http://www.historicengland.org.uk
narrower: Grenade Range
narrower: Rifle Range
scope note: A site, buildings or structure associated with the demonstration and testing of weapons and military equipment. Use more specific term.
publisher: www.historicengland.org.uk
in scheme: First World War Project
narrower: Artillery Firing Range

Defence Site
type: Concept
attribution name: Historic England
license: http://creativecommons.org/licenses/by/3.0
attribution URL: http://www.historicengland.org.uk
in scheme: First World War Project
narrower: Weapon Testing Facility
broader: Military Defence And Fortification
publisher: www.historicengland.org.uk
narrower: Civil Defence Site
narrower: Air Defence Site
narrower: Ancillary Building
narrower: Anti Invasion Defence Site
scope note: Sites, buildings and structures involved in the passive or active defence of the country against hostile forces on land, sea and in the air. Use more specific term.
narrower: Coastal Defence Site
narrower: Defence Work
issued: 2019-07-18T10:15:51
narrower: Airfield Defence Site
narrower: Defence Line

Firing Range
type: Concept
narrower: Firing Range Blockhouse
scope note: A piece of ground, or a building, where small arms or large artillery may be fired at targets. For rocket and missile firing use ROCKET TEST FACILITY.
in scheme: First World War Project
narrower: Torpedo Range
broader: Weapon Testing Facility
narrower: Naval Gunnery Range
issued: 2019-07-18T10:15:51
license: http://creativecommons.org/licenses/by/3.0
attribution URL: http://www.historicengland.org.uk
publisher: www.historicengland.org.uk
narrower: Target Range
attribution name: Historic England
broader: Training Area

Bombing Range
type: Concept
license: http://creativecommons.org/licenses/by/3.0
attribution URL: http://www.historicengland.org.uk
in scheme: First World War Project
related: Bombing Range Marker
narrower: Bombing Range Target
publisher: www.historicengland.org.uk
broader: Weapon Testing Facility
scope note: An area of land, with associated buildings and targets, used for practicing the dropping of bombs and other aspects of air warfare.
issued: 2019-07-18T10:15:51
narrower: Bombing Range Tower
attribution name: Historic England

Grenade Range
type: Concept
license: http://creativecommons.org/licenses/by/3.0
broader: Weapon Testing Facility
attribution URL: http://www.historicengland.org.uk
in scheme: First World War Project
issued: 2019-07-18T10:15:51
broader: Training Area
publisher: www.historicengland.org.uk
attribution name: Historic England
scope note: An area of ground where training in the use of grenades can be carried out.

Rifle Range
type: Concept
scope note: A target range used for rifle and small arms practice.
attribution name: Historic England
in scheme: First World War Project
publisher: www.historicengland.org.uk
broader: Weapon Testing Facility
attribution URL: http://www.historicengland.org.uk
issued: 2019-07-18T10:15:51
license: http://creativecommons.org/licenses/by/3.0

Artillery Firing Range
type: Concept
license: http://creativecommons.org/licenses/by/3.0
attribution name: Historic England
scope note: A piece of ground, or a building, on which artillery may be fired at targets.
broader: Weapon Testing Facility
publisher: www.historicengland.org.uk
in scheme: First World War Project
issued: 2019-07-18T10:15:51
attribution URL: http://www.historicengland.org.uk

MkVI
type: Concept
license: http://creativecommons.org/licenses/by/3.0
attribution URL: http://www.historicengland.org.uk
publisher: www.historicengland.org.uk
attribution name: Historic England
issued: 2019-07-18T10:15:51
broader: Aircraft Mark
in scheme: First World War Project
scope note: Mark 6 or the sixth variant of an aircraft with its associated modifications.

Bombing Range Tower
type: Concept
broader: Bombing Range
scope note: An observation tower located on or near to a bombing range.
attribution URL: http://www.historicengland.org.uk
in scheme: First World War Project
issued: 2019-07-18T10:15:51
license: http://creativecommons.org/licenses/by/3.0
attribution name: Historic England
publisher: www.historicengland.org.uk

Airco DH2
type: Concept
broader: Biplane
issued: 2019-07-18T10:15:51
license: http://creativecommons.org/licenses/by/3.0
attribution name: Historic England
attribution URL: http://www.historicengland.org.uk
publisher: www.historicengland.org.uk
scope note: A single-seat fighter which began service with the RFC's fighter squadron in 1916. Some shortterm success in dealing with new Fokkers but was withdrawn from service in mid-1917.
broader: Airco
alternative label: Dh2
broader: Fighter
in scheme: First World War Project

Lorry Factory
type: Concept
in scheme: First World War Project
broader: Motor Vehicle Engineering Site
license: http://creativecommons.org/licenses/by/3.0
publisher: www.historicengland.org.uk
issued: 2019-07-18T10:15:51
broader: Vehicle Factory
scope note: A factory used for the manufacture and assembly of lorries.
attribution name: Historic England
attribution URL: http://www.historicengland.org.uk

Motor Transport Building
type: Concept
attribution URL: http://www.historicengland.org.uk
attribution name: Historic England
issued: 2019-07-18T10:15:51
license: http://creativecommons.org/licenses/by/3.0
in scheme: First World War Project
scope note: A building, on an airfield or military base, used for the maintenance and storage of motor vehicles.
publisher: www.historicengland.org.uk
broader: Technical And Instructional Site
narrower: Garage
narrower: Vehicle Shed

Garage
type: Concept
attribution URL: http://www.historicengland.org.uk
broader: Motor Transport Building
issued: 2019-07-18T10:15:51
scope note: A building used for the storage and maintenance of motor vehicles.
in scheme: First World War Project
attribution name: Historic England
license: http://creativecommons.org/licenses/by/3.0
publisher: www.historicengland.org.uk

Vehicle Shed
type: Concept
scope note: A shed used for the storage of vehicles.
license: http://creativecommons.org/licenses/by/3.0
attribution name: Historic England
issued: 2019-07-18T10:15:51
in scheme: First World War Project
publisher: www.historicengland.org.uk
attribution URL: http://www.historicengland.org.uk
broader: Motor Transport Building

Munitions Factory
type: Concept
license: http://creativecommons.org/licenses/by/3.0
attribution URL: http://www.historicengland.org.uk
narrower: Small Arms Ammunition Factory
publisher: www.historicengland.org.uk
scope note: A building or site used for the manufacture of weapons, ammunition and military supplies. Use more specific type where known.
narrower: Shell Factory
broader: Factory
issued: 2019-07-18T10:15:51
in scheme: First World War Project
attribution name: Historic England
broader: Armament Manufacturing Site
narrower: Filling Factory

Small Arms Ammunition Factory
type: Concept
issued: 2019-07-18T10:15:51
attribution name: Historic England
in scheme: First World War Project
broader: Munitions Factory
scope note: A factory engaged in the manufacture of small arms ammunition, especially the metal components and filling with the explosive propellant.
license: http://creativecommons.org/licenses/by/3.0
attribution URL: http://www.historicengland.org.uk
publisher: www.historicengland.org.uk

Shell Factory
type: Concept
license: http://creativecommons.org/licenses/by/3.0
scope note: A works or factory where shells or projectiles were machined before they were dispatched to a filling factory to be filled with explosives.
alternative label: Projectile Factory
attribution URL: http://www.historicengland.org.uk
in scheme: First World War Project
publisher: www.historicengland.org.uk
broader: Munitions Factory
issued: 2019-07-18T10:15:51
attribution name: Historic England

Factory
type: Concept
issued: 2019-07-18T10:15:51
broader: Industrial Building
narrower: War Production Factory
license: http://creativecommons.org/licenses/by/3.0
scope note: A building or complex, housing powered machinery and employing a large workforce for manufacturing purposes. Use specific monument type where known.
publisher: www.historicengland.org.uk
narrower: Cotton Waste Works
narrower: Explosives Factory
in scheme: First World War Project
attribution URL: http://www.historicengland.org.uk
attribution name: Historic England
narrower: Munitions Factory
narrower: Vehicle Factory
narrower: Ordnance Factory

Filling Factory
type: Concept
in scheme: First World War Project
attribution URL: http://www.historicengland.org.uk
license: http://creativecommons.org/licenses/by/3.0
broader: Munitions Factory
scope note: A factory where explosives and the components of munitions of all types are brought together for assembly.
attribution name: Historic England
issued: 2019-07-18T10:15:51
publisher: www.historicengland.org.uk

Ambulance Park
type: Concept
publisher: www.historicengland.org.uk
in scheme: First World War Project
broader: Vehicle Park
attribution URL: http://www.historicengland.org.uk
scope note: A site where ambulances can br parked and stored.
license: http://creativecommons.org/licenses/by/3.0
attribution name: Historic England
issued: 2019-07-18T10:15:51

MkIII
type: Concept
attribution name: Historic England
in scheme: First World War Project
publisher: www.historicengland.org.uk
broader: Aircraft Mark
attribution URL: http://www.historicengland.org.uk
issued: 2019-07-18T10:15:51
scope note: Mark 3 or the third variant of an aircraft with its associated modifications.
license: http://creativecommons.org/licenses/by/3.0

Car Factory
type: Concept
scope note: A factory where cars are manufactured.
attribution URL: http://www.historicengland.org.uk
broader: Vehicle Factory
issued: 2019-07-18T10:15:51
license: http://creativecommons.org/licenses/by/3.0
in scheme: First World War Project
publisher: www.historicengland.org.uk
attribution name: Historic England
broader: Motor Vehicle Engineering Site

Aircraft Testing Site
type: Concept
attribution URL: http://www.historicengland.org.uk
in scheme: First World War Project
issued: 2019-07-18T10:15:51
license: http://creativecommons.org/licenses/by/3.0
attribution name: Historic England
publisher: www.historicengland.org.uk
broader: Aircraft Engineering Site
scope note: A site used for the functional testing of aircraft and their components.

Gun Emplacement (Type 55491)
type: Concept
in scheme: First World War Project
attribution name: Historic England
license: http://creativecommons.org/licenses/by/3.0
issued: 2019-07-18T10:15:51
broader: Gun Emplacement
publisher: www.historicengland.org.uk
attribution URL: http://www.historicengland.org.uk
scope note: A gun emplacment which conforms to Department of Fortification and Works drawing number 55491.

Gun Emplacement
type: Concept
broader: Anti Invasion Defence Site
publisher: www.historicengland.org.uk
narrower: Holdfast
narrower: Gun Emplacement (Type 55491)
narrower: Gun Emplacement (Type 55414)
in scheme: First World War Project
narrower: Gun Emplacement (Type 55483)
narrower: Gun Emplacement (Type 55503)
issued: 2019-07-18T10:15:51
attribution name: Historic England
narrower: Machine Gun Emplacement
narrower: Gun Emplacement (Type 55422)
narrower: Gun Emplacement (Type 55415)
license: http://creativecommons.org/licenses/by/3.0
scope note: A fortified site in which a gun, mortar or cannon is positioned.
attribution URL: http://www.historicengland.org.uk
narrower: Anti Aircraft Gun Emplacement

Storage Depot
type: Concept
in scheme: First World War Project
attribution URL: http://www.historicengland.org.uk
scope note: A building or site used for the storage of goods or equipment.
license: http://creativecommons.org/licenses/by/3.0
attribution name: Historic England
issued: 2019-07-18T10:15:51
publisher: www.historicengland.org.uk
broader: Depot

Depot
type: Concept
narrower: Royal Naval Depot
narrower: Supply Depot
narrower: Fuel Depot
narrower: Ordnance Depot
scope note: A building or site used as a storage and distribution centre.
attribution name: Historic England
license: http://creativecommons.org/licenses/by/3.0
narrower: Ammunition Depot
publisher: www.historicengland.org.uk
attribution URL: http://www.historicengland.org.uk
issued: 2019-07-18T10:15:51
narrower: Storage Depot
narrower: Food Depot
in scheme: First World War Project
narrower: Remount Depot
broader: Storage Facility
narrower: Vehicle Depot

General Aircraft
type: Concept
attribution name: Historic England
license: http://creativecommons.org/licenses/by/3.0
in scheme: First World War Project
publisher: www.historicengland.org.uk
attribution URL: http://www.historicengland.org.uk
scope note: General Aircraft Limited.
issued: 2019-07-18T10:15:51
broader: Aircraft <By Manufacturer>

Transporter
type: Concept
attribution name: Historic England
license: http://creativecommons.org/licenses/by/3.0
broader: Aircraft <By Function>
in scheme: First World War Project
publisher: www.historicengland.org.uk
attribution URL: http://www.historicengland.org.uk
scope note: An aircraft used for the transportation of troops, supplies, vehicles or passengers.
issued: 2019-07-18T10:15:51
narrower: Bleriot 155
narrower: Fokker

Aircraft <By Function>
type: Concept
narrower: Communications
narrower: Bomber
attribution URL: http://www.historicengland.org.uk
narrower: Transporter
attribution name: Historic England
issued: 2019-07-18T10:15:51
narrower: Target
narrower: Tug
in scheme: First World War Project
license: http://creativecommons.org/licenses/by/3.0
broader: Aircraft Type
narrower: Reconnaissance
narrower: Trainer
narrower: Test Aircraft
narrower: Fighter
narrower: Minelayer
publisher: www.historicengland.org.uk

Fokker
type: Concept
publisher: www.historicengland.org.uk
issued: 2019-07-18T10:15:51
broader: Monoplane
attribution URL: http://www.historicengland.org.uk
attribution name: Historic England
in scheme: First World War Project
broader: Transporter
license: http://creativecommons.org/licenses/by/3.0
scope note: Dutch aircraft manufacturer named after its founder, Anthony Fokker. Set up in 1912 in Schwerin, Germany, moving to the Netherlands in 1919. The world's largest aircraft manufacturer in the late 1920s.
broader: Aircraft <By Manufacturer>

Seaplane
type: Concept
in scheme: First World War Project
attribution URL: http://www.historicengland.org.uk
license: http://creativecommons.org/licenses/by/3.0
narrower: Flying Boat
narrower: Floatplane
attribution name: Historic England
issued: 2019-07-18T10:15:51
scope note: An aircraft designed to land on water. They can be divided into 2 types: Flying boats (designed with a hull allowing the aircraft to land directly on water) and Floatplanes (where the undercarriage was replaced by fixed floats).
publisher: www.historicengland.org.uk
broader: Aircraft <By Form>

Flying Boat
type: Concept
broader: Seaplane
attribution URL: http://www.historicengland.org.uk
issued: 2019-07-18T10:15:51
attribution name: Historic England
publisher: www.historicengland.org.uk
scope note: An aeroplane with the capability to land at sea, the underside of its fuselage shaped like the hull of a sea-going vessel and designed to make contact with the water.
license: http://creativecommons.org/licenses/by/3.0
in scheme: First World War Project

Floatplane
type: Concept
attribution name: Historic England
broader: Seaplane
issued: 2019-07-18T10:15:51
license: http://creativecommons.org/licenses/by/3.0
scope note: A type of seaplane, with one or more slender pontoons (known as "floats") mounted under the fuselage to provide buoyancy.
in scheme: First World War Project
publisher: www.historicengland.org.uk
attribution URL: http://www.historicengland.org.uk

Aircraft <By Form>
type: Concept
attribution name: Historic England
narrower: Seaplane
license: http://creativecommons.org/licenses/by/3.0
narrower: Monoplane
in scheme: First World War Project
narrower: Triplane
attribution URL: http://www.historicengland.org.uk
publisher: www.historicengland.org.uk
narrower: Airship
broader: Aircraft Type
narrower: Light Aircraft
narrower: Biplane
narrower: Glider
issued: 2019-07-18T10:15:51

Cartridge House
type: Concept
attribution name: Historic England
issued: 2019-07-18T10:15:51
in scheme: First World War Project
broader: Explosives Manufacturing Site
publisher: www.historicengland.org.uk
scope note: A component building of an explosives works where cartridges were filled with explosives with the aid of cartridging machines.
attribution URL: http://www.historicengland.org.uk
license: http://creativecommons.org/licenses/by/3.0

Bombing Range Target
type: Concept
attribution URL: http://www.historicengland.org.uk
issued: 2019-07-18T10:15:51
scope note: Any structure or object, used for the purpose of practice bombing.
in scheme: First World War Project
attribution name: Historic England
license: http://creativecommons.org/licenses/by/3.0
broader: Bombing Range
publisher: www.historicengland.org.uk

Vimy
type: Concept
broader: Vickers
in scheme: First World War Project
license: http://creativecommons.org/licenses/by/3.0
publisher: www.historicengland.org.uk
scope note: Twin-engine, three-crew, long-range heavy bomber biplane. Entered service in 1917. Of wooden construction with a fabric covering, the Vimy was fitted with a skid under the nose of its fuselage to prevent tipping forward upon landing.
issued: 2019-07-18T10:15:51
attribution URL: http://www.historicengland.org.uk
broader: Heavy Bomber
attribution name: Historic England
broader: Biplane

Heavy Bomber
type: Concept
attribution URL: http://www.historicengland.org.uk
narrower: Vimy
issued: 2019-07-18T10:15:51
scope note: Long-range, usually four-engined, bomber.
in scheme: First World War Project
attribution name: Historic England
license: http://creativecommons.org/licenses/by/3.0
narrower: V1500
narrower: Gotha Gv
publisher: www.historicengland.org.uk
broader: Bomber

Railway Engineering Site
type: Concept
issued: 2019-07-18T10:15:51
narrower: Railway Engineering Works
publisher: www.historicengland.org.uk
attribution URL: http://www.historicengland.org.uk
narrower: Railway Carriage Works
scope note: Buildings, sites and structures associated with the construction and maintenance of railways and rolling stock.
broader: Vehicle Engineering Site
attribution name: Historic England
narrower: Railway Engineering Workshop
narrower: Steaming Shed
narrower: Railway Workshop
narrower: Railway Works
narrower: Railway Wagon Works
license: http://creativecommons.org/licenses/by/3.0
in scheme: First World War Project

Railway Engineering Works
type: Concept
license: http://creativecommons.org/licenses/by/3.0
attribution URL: http://www.historicengland.org.uk
in scheme: First World War Project
broader: Railway Engineering Site
publisher: www.historicengland.org.uk
scope note: A large site specializing in the manufacture of locomotives.
issued: 2019-07-18T10:15:51
attribution name: Historic England

Railway Carriage Works
type: Concept
scope note: An engineering site where railway carriages are manufactured.
issued: 2019-07-18T10:15:51
broader: Railway Engineering Site
publisher: www.historicengland.org.uk
attribution URL: http://www.historicengland.org.uk
attribution name: Historic England
license: http://creativecommons.org/licenses/by/3.0
in scheme: First World War Project

Vehicle Engineering Site
type: Concept
narrower: Motor Vehicle Engineering Site
publisher: www.historicengland.org.uk
issued: 2019-07-18T10:15:51
narrower: Railway Engineering Site
broader: Engineering Industry Site
attribution name: Historic England
in scheme: First World War Project
attribution URL: http://www.historicengland.org.uk
narrower: Aircraft Engineering Site
scope note: Sites associated with the manufacture and engineering of vehicles.
license: http://creativecommons.org/licenses/by/3.0
narrower: Bicycle Factory

Railway Engineering Workshop
type: Concept
broader: Railway Engineering Site
in scheme: First World War Project
license: http://creativecommons.org/licenses/by/3.0
publisher: www.historicengland.org.uk
scope note: An engineering workshop, often attached to an engine shed, for the running repairs of operational parts, etc.
issued: 2019-07-18T10:15:51
attribution URL: http://www.historicengland.org.uk
attribution name: Historic England

Steaming Shed
type: Concept
broader: Railway Engineering Site
in scheme: First World War Project
scope note: A building used specifically for testing the boilers of railway engines, both hydraulically and with live steam.
license: http://creativecommons.org/licenses/by/3.0
publisher: www.historicengland.org.uk
issued: 2019-07-18T10:15:51
attribution URL: http://www.historicengland.org.uk
attribution name: Historic England

Railway Workshop
type: Concept
attribution URL: http://www.historicengland.org.uk
broader: Railway Engineering Site
in scheme: First World War Project
scope note: An ancilliary workshop used for repairs, etc.
issued: 2019-07-18T10:15:51
license: http://creativecommons.org/licenses/by/3.0
attribution name: Historic England
publisher: www.historicengland.org.uk

Railway Works
type: Concept
license: http://creativecommons.org/licenses/by/3.0
attribution name: Historic England
scope note: An engineering works producing items for the railway other than rolling stock, such as signals, tracks, points, etc.
in scheme: First World War Project
issued: 2019-07-18T10:15:51
publisher: www.historicengland.org.uk
broader: Railway Engineering Site
attribution URL: http://www.historicengland.org.uk

Railway Wagon Works
type: Concept
publisher: www.historicengland.org.uk
scope note: Engineering works specializing in the production and maintenance of non-passenger carrying railway rolling stock.
attribution URL: http://www.historicengland.org.uk
license: http://creativecommons.org/licenses/by/3.0
in scheme: First World War Project
broader: Railway Engineering Site
issued: 2019-07-18T10:15:51
attribution name: Historic England
alternative label: Waggon Workshop

Bombing Range Marker
type: Concept
scope note: A range marker allowing bombers to locate the bombing range.
related: Bombing Range
license: http://creativecommons.org/licenses/by/3.0
attribution name: Historic England
issued: 2019-07-18T10:15:51
in scheme: First World War Project
publisher: www.historicengland.org.uk
attribution URL: http://www.historicengland.org.uk
broader: Military Defence And Fortification
alternative label: Bombing Range Direction Arrow

Domestic Site
type: Concept
narrower: Decontamination Building
narrower: Cinema
narrower: Womens Land Army Camp
narrower: Sick Quarters
narrower: Gymnasium
license: http://creativecommons.org/licenses/by/3.0
narrower: Parade Ground
narrower: Food And Rest Centre
narrower: Squash Racquets Court
narrower: Concert Hall
narrower: Medical Block
narrower: Meeting Hall
scope note: Buildings used for the accommodation, welfare and recreation of servicemen.
narrower: Womens Land Army Hostel
attribution URL: http://www.historicengland.org.uk
attribution name: Historic England
in scheme: First World War Project
issued: 2019-07-18T10:15:51
narrower: Tennis Court
broader: Military Defence And Fortification
publisher: www.historicengland.org.uk

Decontamination Building
type: Concept
attribution URL: http://www.historicengland.org.uk
attribution name: Historic England
issued: 2019-07-18T10:15:51
license: http://creativecommons.org/licenses/by/3.0
in scheme: First World War Project
publisher: www.historicengland.org.uk
scope note: A building used for the treatment of victims of chemical, gas or other forms of contamination.
alternative label: Gas Decontamination Centre
broader: Domestic Site

Cinema
type: Concept
in scheme: First World War Project
broader: Domestic Site
scope note: A building equipped with a large screen and film projectors where service personnel could watch films.
attribution name: Historic England
issued: 2019-07-18T10:15:51
publisher: www.historicengland.org.uk
attribution URL: http://www.historicengland.org.uk
license: http://creativecommons.org/licenses/by/3.0

Womens Land Army Camp
type: Concept
license: http://creativecommons.org/licenses/by/3.0
attribution URL: http://www.historicengland.org.uk
publisher: www.historicengland.org.uk
attribution name: Historic England
issued: 2019-07-18T10:15:51
broader: Domestic Site
scope note: A camp used to accommodate members of the Womens Land Army who undertook essential agricultural work during the First and Second World Wars.
in scheme: First World War Project

Sick Quarters
type: Concept
license: http://creativecommons.org/licenses/by/3.0
attribution URL: http://www.historicengland.org.uk
publisher: www.historicengland.org.uk
attribution name: Historic England
issued: 2019-07-18T10:15:51
broader: Domestic Site
in scheme: First World War Project
scope note: A building used for the accommodation of sick and wounded members of the armed forces.

Gymnasium
type: Concept
attribution URL: http://www.historicengland.org.uk
broader: Domestic Site
in scheme: First World War Project
scope note: A building or room, originally equipped for gymnastics or indoor sports but also, more recently, equipped with cross-training machines and free-weights for members to improve their physical fitness.
issued: 2019-07-18T10:15:51
license: http://creativecommons.org/licenses/by/3.0
attribution name: Historic England
publisher: www.historicengland.org.uk

Parade Ground
type: Concept
publisher: www.historicengland.org.uk
in scheme: First World War Project
broader: Domestic Site
attribution URL: http://www.historicengland.org.uk
scope note: A place where military personnel parade, practice marching, assemble or muster for a march or any other special purpose.
license: http://creativecommons.org/licenses/by/3.0
attribution name: Historic England
issued: 2019-07-18T10:15:51

Food And Rest Centre
type: Concept
license: http://creativecommons.org/licenses/by/3.0
attribution URL: http://www.historicengland.org.uk
in scheme: First World War Project
publisher: www.historicengland.org.uk
broader: Domestic Site
issued: 2019-07-18T10:15:51
attribution name: Historic England

Squash Racquets Court
type: Concept
license: http://creativecommons.org/licenses/by/3.0
attribution URL: http://www.historicengland.org.uk
publisher: www.historicengland.org.uk
attribution name: Historic England
issued: 2019-07-18T10:15:51
broader: Domestic Site
in scheme: First World War Project
scope note: A building in which the game of squash can be played.

Concert Hall
type: Concept
issued: 2019-07-18T10:15:51
attribution name: Historic England
broader: Domestic Site
publisher: www.historicengland.org.uk
attribution URL: http://www.historicengland.org.uk
in scheme: First World War Project
license: http://creativecommons.org/licenses/by/3.0
scope note: A place where service personnel could meet and listen to musical performances etc.

Medical Block
type: Concept
attribution name: Historic England
license: http://creativecommons.org/licenses/by/3.0
scope note: A building, usually part of a complex, where medical treatment and hospital facilities are provided.
in scheme: First World War Project
publisher: www.historicengland.org.uk
attribution URL: http://www.historicengland.org.uk
broader: Domestic Site
issued: 2019-07-18T10:15:51

Meeting Hall
type: Concept
in scheme: First World War Project
license: http://creativecommons.org/licenses/by/3.0
publisher: www.historicengland.org.uk
issued: 2019-07-18T10:15:51
scope note: A place where service personnel could meet for entertainment.
attribution URL: http://www.historicengland.org.uk
broader: Domestic Site
attribution name: Historic England

Womens Land Army Hostel
type: Concept
broader: Domestic Site
attribution URL: http://www.historicengland.org.uk
scope note: A hostel used to accommodate members of the Womens Land Army who undertook essential agricultural work during the First and Second World Wars.
issued: 2019-07-18T10:15:51
attribution name: Historic England
license: http://creativecommons.org/licenses/by/3.0
in scheme: First World War Project
publisher: www.historicengland.org.uk

Tennis Court
type: Concept
publisher: www.historicengland.org.uk
in scheme: First World War Project
scope note: A prepared area, traditionally grass, where tennis is played.
attribution URL: http://www.historicengland.org.uk
license: http://creativecommons.org/licenses/by/3.0
attribution name: Historic England
broader: Domestic Site
issued: 2019-07-18T10:15:51

Blackburn
type: Concept
attribution URL: http://www.historicengland.org.uk
broader: Aircraft <By Manufacturer>
issued: 2019-07-18T10:15:51
license: http://creativecommons.org/licenses/by/3.0
in scheme: First World War Project
attribution name: Historic England
publisher: www.historicengland.org.uk
scope note: Blackburn Aircraft, Ltd., founded by Robert Blackburn, who produced his first aircraft in 1910. Specialised in the production of torpedocarrying aircraft.

Military Hospital
type: Concept
attribution URL: http://www.historicengland.org.uk
license: http://creativecommons.org/licenses/by/3.0
broader: Hospital
in scheme: First World War Project
scope note: A hospital for the medical and surgical treatment of military personnel and/or their families.
attribution name: Historic England
issued: 2019-07-18T10:15:51
publisher: www.historicengland.org.uk

MkIIA
type: Concept
publisher: www.historicengland.org.uk
scope note: A Mark 2 aircraft which has undergone slight modifications to enhance performance or armament.
license: http://creativecommons.org/licenses/by/3.0
in scheme: First World War Project
issued: 2019-07-18T10:15:51
broader: Aircraft Mark
attribution name: Historic England
attribution URL: http://www.historicengland.org.uk

Aircraft Hangar (Transportable)
type: Concept
attribution name: Historic England
license: http://creativecommons.org/licenses/by/3.0
broader: Aircraft Hangar
attribution URL: http://www.historicengland.org.uk
in scheme: First World War Project
publisher: www.historicengland.org.uk
scope note: An aircraft hangar designed to be moved from site to site as necessary.
narrower: Bessonneau Hangar (Type H)
issued: 2019-07-18T10:15:51

Aircraft Hangar
type: Concept
narrower: Aircraft Hangar (Transportable)
attribution URL: http://www.historicengland.org.uk
license: http://creativecommons.org/licenses/by/3.0
narrower: Royal Flying Corps Aircraft Hangar
in scheme: First World War Project
broader: Aircraft Storage Facility
attribution name: Historic England
narrower: Aeroplane Twin Shed
alternative label: Aircraft Shed
issued: 2019-07-18T10:15:51
scope note: A structure used for the housing and servicing of aircraft.
publisher: www.historicengland.org.uk

Bessonneau Hangar (Type H)
type: Concept
attribution URL: http://www.historicengland.org.uk
issued: 2019-07-18T10:15:51
in scheme: First World War Project
attribution name: Historic England
license: http://creativecommons.org/licenses/by/3.0
broader: Aircraft Hangar (Transportable)
scope note: The first transportable aircraft hangar developed by the RFC/RAF, which comprised a kit of timber and canvas that could be assembled in 48 hours. The canvas doors open one end only. Also known as Type H hangar.
publisher: www.historicengland.org.uk

Photo Reconnaissance
type: Concept
publisher: www.historicengland.org.uk
in scheme: First World War Project
attribution URL: http://www.historicengland.org.uk
scope note: A camera-equipped aircraft intended to fly over enemy territory and gather photographic evidence of strategic features and/or the position and strength of any military presence.
license: http://creativecommons.org/licenses/by/3.0
attribution name: Historic England
broader: Reconnaissance
issued: 2019-07-18T10:15:51

Bomb Store
type: Concept
attribution URL: http://www.historicengland.org.uk
license: http://creativecommons.org/licenses/by/3.0
publisher: www.historicengland.org.uk
in scheme: First World War Project
attribution name: Historic England
scope note: A complex of buildings and earthworks constructed the storage of bombs and pyrotechnics.
broader: Ammunition Store
issued: 2019-07-18T10:15:51

Ammunition Store
type: Concept
license: http://creativecommons.org/licenses/by/3.0
broader: Ancillary Building
attribution URL: http://www.historicengland.org.uk
scope note: An building or installation used for the storage of ammunition.
attribution name: Historic England
issued: 2019-07-18T10:15:51
in scheme: First World War Project
publisher: www.historicengland.org.uk
narrower: Bomb Store

Engine House
type: Concept
broader: Ancillary Building
issued: 2019-07-18T10:15:51
scope note: A building housing an engine used to run electrical equipment. Use more specific type where known.
attribution name: Historic England
publisher: www.historicengland.org.uk
license: http://creativecommons.org/licenses/by/3.0
attribution URL: http://www.historicengland.org.uk
in scheme: First World War Project
narrower: Battery Engine House

Naval Gunnery Range
type: Concept
broader: Firing Range
license: http://creativecommons.org/licenses/by/3.0
attribution URL: http://www.historicengland.org.uk
publisher: www.historicengland.org.uk
scope note: An area of ground, usually situated on the coast, on which naval guns can be mounted for testing purposes and to practice firing at targets usually placed out at sea to mimic surface vessels.
attribution name: Historic England
issued: 2019-07-18T10:15:51
in scheme: First World War Project

Magazine
type: Concept
attribution name: Historic England
in scheme: First World War Project
broader: Heavy Anti Aircraft Battery
publisher: www.historicengland.org.uk
scope note: A building in which a supply of arms, ammunition and provisions for an army is stored.
attribution URL: http://www.historicengland.org.uk
issued: 2019-07-18T10:15:51
license: http://creativecommons.org/licenses/by/3.0

Heavy Anti Aircraft Battery
type: Concept
attribution name: Historic England
in scheme: First World War Project
attribution URL: http://www.historicengland.org.uk
broader: Anti Aircraft Battery
publisher: www.historicengland.org.uk
narrower: Magazine
scope note: An anti aircraft battery usually mounting weapons with a larger calibre ammunition such as the QF 3.75 inch (94mm) gun.
license: http://creativecommons.org/licenses/by/3.0
narrower: Gun Store
issued: 2019-07-18T10:15:51

Aircraft Storage Facility
type: Concept
license: http://creativecommons.org/licenses/by/3.0
attribution name: Historic England
broader: Airfield Site
narrower: Airship Hangar
narrower: Seaplane Shed
narrower: Aircraft Hangar
scope note: A site, building or structure used to store aircraft. Use more specific term.
publisher: www.historicengland.org.uk
issued: 2019-07-18T10:15:51
in scheme: First World War Project
attribution URL: http://www.historicengland.org.uk

Airship Hangar
type: Concept
issued: 2019-07-18T10:15:51
attribution name: Historic England
related: Balloon Shed
attribution URL: http://www.historicengland.org.uk
publisher: www.historicengland.org.uk
in scheme: First World War Project
license: http://creativecommons.org/licenses/by/3.0
broader: Aircraft Storage Facility
scope note: A hangar for the storage and maintenance of dirigible motor-driven balloons.

Seaplane Shed
type: Concept
publisher: www.historicengland.org.uk
license: http://creativecommons.org/licenses/by/3.0
in scheme: First World War Project
narrower: Seaplane Shed (Type F)
narrower: Seaplane Shed (Type J)
broader: Aircraft Storage Facility
issued: 2019-07-18T10:15:51
narrower: Seaplane Shed (Type G)
attribution name: Historic England
scope note: An aircraft hangar designed to house seaplanes.
alternative label: Seaplane Hangar
attribution URL: http://www.historicengland.org.uk

MkVIC
type: Concept
attribution name: Historic England
license: http://creativecommons.org/licenses/by/3.0
in scheme: First World War Project
publisher: www.historicengland.org.uk
scope note: A Mark 6B aircraft which has undergone further modifications to enhance performance or armament.
attribution URL: http://www.historicengland.org.uk
broader: Aircraft Mark
issued: 2019-07-18T10:15:51

Sound Mirror (20 Feet)
type: Concept
scope note: A concrete, circular concave dish 20 feet in diameter used as an acoustic listening device to detect approaching enemy aircraft.
license: http://creativecommons.org/licenses/by/3.0
broader: Sound Mirror
attribution URL: http://www.historicengland.org.uk
issued: 2019-07-18T10:15:51
attribution name: Historic England
in scheme: First World War Project
publisher: www.historicengland.org.uk

Sound Mirror
type: Concept
in scheme: First World War Project
attribution URL: http://www.historicengland.org.uk
broader: Passive Air Defence Site
publisher: www.historicengland.org.uk
scope note: An early warning structure built during and after WWI along the south and east coasts of England. Sound detecting acoustic dishes and walls could detect the sound of approaching enemy aircraft at a distance of 8 to 15 miles.
related: Listening Post
narrower: Sound Mirror (200 Feet)
alternative label: Sound Dish
issued: 2019-07-18T10:15:51
narrower: Sound Mirror (20 Feet)
attribution name: Historic England
narrower: Sound Mirror (30 Feet)
license: http://creativecommons.org/licenses/by/3.0

Clothing Industry Site
type: Concept
in scheme: First World War Project
license: http://creativecommons.org/licenses/by/3.0
publisher: www.historicengland.org.uk
issued: 2019-07-18T10:15:51
broader: Industrial
narrower: Clothing Workshop
attribution URL: http://www.historicengland.org.uk
attribution name: Historic England

Clothing Workshop
type: Concept
license: http://creativecommons.org/licenses/by/3.0
attribution URL: http://www.historicengland.org.uk
in scheme: First World War Project
publisher: www.historicengland.org.uk
scope note: A workshop for the manufacture of clothing, eg. tailor's workshop.
broader: Clothing Industry Site
issued: 2019-07-18T10:15:51
attribution name: Historic England

Trench
type: Concept
narrower: Communication Trench
narrower: Fire Trench
license: http://creativecommons.org/licenses/by/3.0
scope note: A linear fieldwork dug as a means of concealment, protection or both.
attribution name: Historic England
issued: 2019-07-18T10:15:51
in scheme: First World War Project
publisher: www.historicengland.org.uk
broader: Fieldwork
attribution URL: http://www.historicengland.org.uk
narrower: Slit Trench

Communication Trench
type: Concept
attribution URL: http://www.historicengland.org.uk
scope note: A trench, usually linking two or more rows of trenches, enabling the conveyance of messages or equipment safely from one trench to another.
broader: Trench
issued: 2019-07-18T10:15:51
attribution name: Historic England
license: http://creativecommons.org/licenses/by/3.0
in scheme: First World War Project
publisher: www.historicengland.org.uk

Fire Trench
type: Concept
broader: Trench
in scheme: First World War Project
issued: 2019-07-18T10:15:51
attribution name: Historic England
scope note: A trench cut around a building or structure to prevent the spread of fire.
publisher: www.historicengland.org.uk
attribution URL: http://www.historicengland.org.uk
license: http://creativecommons.org/licenses/by/3.0

Slit Trench
type: Concept
attribution URL: http://www.historicengland.org.uk
in scheme: First World War Project
issued: 2019-07-18T10:15:51
license: http://creativecommons.org/licenses/by/3.0
attribution name: Historic England
publisher: www.historicengland.org.uk
broader: Trench
scope note: A short trench used to protect troops or to provide defensive fire from, often dug for practice purposes.

Barrack Block
type: Concept
attribution URL: http://www.historicengland.org.uk
scope note: A building used for the accommodation of members of the armed forces.
license: http://creativecommons.org/licenses/by/3.0
in scheme: First World War Project
attribution name: Historic England
issued: 2019-07-18T10:15:51
related: Ablutions Block
publisher: www.historicengland.org.uk
broader: Ancillary Building

Ablutions Block
type: Concept
publisher: www.historicengland.org.uk
attribution URL: http://www.historicengland.org.uk
in scheme: First World War Project
broader: Ancillary Building
scope note: A building housing toilets and washing facilities.
related: Barrack Block
license: http://creativecommons.org/licenses/by/3.0
attribution name: Historic England
issued: 2019-07-18T10:15:51

Ordnance Depot
type: Concept
issued: 2019-07-18T10:15:51
scope note: A building or site used by the armed forces for the storage and issuing of military stores and materials.
in scheme: First World War Project
publisher: www.historicengland.org.uk
attribution URL: http://www.historicengland.org.uk
license: http://creativecommons.org/licenses/by/3.0
attribution name: Historic England
broader: Depot

Air Raid Shelter
type: Concept
publisher: www.historicengland.org.uk
attribution name: Historic England
issued: 2019-07-18T10:15:51
in scheme: First World War Project
scope note: A fortified structure used to protect civilians and/or military personnel from enemy bombing.
broader: Civil Defence Site
license: http://creativecommons.org/licenses/by/3.0
attribution URL: http://www.historicengland.org.uk
narrower: Blast Shelter

Civil Defence Site
type: Concept
license: http://creativecommons.org/licenses/by/3.0
attribution URL: http://www.historicengland.org.uk
in scheme: First World War Project
narrower: Air Raid Shelter
publisher: www.historicengland.org.uk
scope note: Sites and buildings used in the coordination of the defence of the civilian population during times of war. Could also be used during times of national emergency.
narrower: Civil Defence Building
related: First Aid Post
broader: Defence Site
attribution name: Historic England
issued: 2019-07-18T10:15:51

Blast Shelter
type: Concept
issued: 2019-07-18T10:15:51
publisher: www.historicengland.org.uk
attribution name: Historic England
broader: Air Raid Shelter
scope note: A protective structure, often made of sandbags with reinforcement, designed to protect aircraft at airfields from enemy attack.
in scheme: First World War Project
attribution URL: http://www.historicengland.org.uk
license: http://creativecommons.org/licenses/by/3.0

MkIV
type: Concept
attribution name: Historic England
broader: Aircraft Mark
issued: 2019-07-18T10:15:51
attribution URL: http://www.historicengland.org.uk
publisher: www.historicengland.org.uk
scope note: Mark 4 or the fourth variant of an aircraft with its associated modifications.
in scheme: First World War Project
license: http://creativecommons.org/licenses/by/3.0

MkVB
type: Concept
publisher: www.historicengland.org.uk
in scheme: First World War Project
broader: Aircraft Mark
attribution URL: http://www.historicengland.org.uk
scope note: A Mark 5A aircraft which has undergone further modifications to enhance performance or armament.
license: http://creativecommons.org/licenses/by/3.0
attribution name: Historic England
issued: 2019-07-18T10:15:51

Pillbox (Variant)
type: Concept
license: http://creativecommons.org/licenses/by/3.0
attribution URL: http://www.historicengland.org.uk
in scheme: First World War Project
publisher: www.historicengland.org.uk
broader: Pillbox
issued: 2019-07-18T10:15:51
scope note: A pillbox which varies from the standard designs.
attribution name: Historic England

Pillbox
type: Concept
attribution name: Historic England
attribution URL: http://www.historicengland.org.uk
narrower: Pillbox (Shellproof)
license: http://creativecommons.org/licenses/by/3.0
issued: 2019-07-18T10:15:51
narrower: Pillbox (Variant)
broader: Anti Invasion Defence Site
publisher: www.historicengland.org.uk
in scheme: First World War Project
scope note: An often squat building with thick, loopholed walls and a flat roof, designed to accommodate a variety of weapons, usually strategically positioned to cover a vulnerable point in a defensive system.

Bellite Works
type: Concept
issued: 2019-07-18T10:15:51
attribution URL: http://www.historicengland.org.uk
attribution name: Historic England
in scheme: First World War Project
license: http://creativecommons.org/licenses/by/3.0
publisher: www.historicengland.org.uk
broader: Explosives Factory
scope note: A works engaged principally in the manufacture of the explosive bellite.

Snipe
type: Concept
attribution URL: http://www.historicengland.org.uk
in scheme: First World War Project
issued: 2019-07-18T10:15:51
broader: Fighter
broader: Sopwith
attribution name: Historic England
license: http://creativecommons.org/licenses/by/3.0
related: Camel
broader: Biplane
scope note: Single-engined fighter, developed from the Camel. Entered service in 1918 and became the RAF's first mainstay peacetime fighter.
publisher: www.historicengland.org.uk

Sopwith
type: Concept
attribution URL: http://www.historicengland.org.uk
broader: Aircraft <By Manufacturer>
in scheme: First World War Project
issued: 2019-07-18T10:15:51
license: http://creativecommons.org/licenses/by/3.0
attribution name: Historic England
publisher: www.historicengland.org.uk
narrower: Camel
scope note: The Sopwith Aviation Co., Ltd.. Established in 1911 by the noted aviator Mr T. O. M. Sopwith. Produced many notable aircraft, including the Camel and a Schneider Cup-winning seaplane.
narrower: Snipe

Camel
type: Concept
broader: Biplane
broader: Sopwith
license: http://creativecommons.org/licenses/by/3.0
attribution URL: http://www.historicengland.org.uk
broader: Fighter
publisher: www.historicengland.org.uk
scope note: Single-seat, single-engine fighter biplane renowned for its high performance and manoeuvrability. Entered service in 1917.
attribution name: Historic England
issued: 2019-07-18T10:15:51
in scheme: First World War Project
related: Snipe

MkIC
type: Concept
license: http://creativecommons.org/licenses/by/3.0
scope note: A Mark 1B aircraft which has undergone further modification to enhance performance or armament.
attribution URL: http://www.historicengland.org.uk
in scheme: First World War Project
issued: 2019-07-18T10:15:51
attribution name: Historic England
publisher: www.historicengland.org.uk
broader: Aircraft Mark

Dive Bomber
type: Concept
attribution name: Historic England
broader: Fighter Bomber
issued: 2019-07-18T10:15:51
in scheme: First World War Project
publisher: www.historicengland.org.uk
scope note: A fighter-bomber designed to deploy its bombs during the latter stage of a diving manoeuvre, thus increasing the accuracy of its targetting.
attribution URL: http://www.historicengland.org.uk
license: http://creativecommons.org/licenses/by/3.0

Fighter Bomber
type: Concept
issued: 2019-07-18T10:15:51
attribution URL: http://www.historicengland.org.uk
attribution name: Historic England
broader: Bomber
in scheme: First World War Project
license: http://creativecommons.org/licenses/by/3.0
scope note: A light, high speed aircraft designed to engage in aerial combat and also equipped to carry bombs.
narrower: Dive Bomber
broader: Fighter
publisher: www.historicengland.org.uk

Army Headquarters
type: Concept
broader: Military Headquarters
attribution URL: http://www.historicengland.org.uk
license: http://creativecommons.org/licenses/by/3.0
in scheme: First World War Project
attribution name: Historic England
issued: 2019-07-18T10:15:51
scope note: A building used for the daily administration of an army.
publisher: www.historicengland.org.uk

Military Headquarters
type: Concept
publisher: www.historicengland.org.uk
narrower: Territorial Army Headquarters
license: http://creativecommons.org/licenses/by/3.0
attribution URL: http://www.historicengland.org.uk
narrower: Air Force Headquarters
scope note: A building used as the command centre of a military operation.
narrower: Army Headquarters
narrower: Naval Headquarters
attribution name: Historic England
broader: Ancillary Building
in scheme: First World War Project
issued: 2019-07-18T10:15:51

Marine Construction Site
type: Concept
narrower: Boat Yard
narrower: Dry Dock
attribution name: Historic England
narrower: Seaplane Factory
publisher: www.historicengland.org.uk
narrower: Wet Dock
narrower: Ship Repair Works
attribution URL: http://www.historicengland.org.uk
narrower: Dockyard
license: http://creativecommons.org/licenses/by/3.0
narrower: Marine Engineering Works
narrower: Ship Breakers Yard
narrower: Marine Workshop
issued: 2019-07-18T10:15:51
narrower: Half Tide Dock
in scheme: First World War Project
broader: Industrial
scope note: Buildings, sites and structures associated with the construction and repair of ships and boats.
narrower: Shipyard

Boat Yard
type: Concept
issued: 2019-07-18T10:15:51
license: http://creativecommons.org/licenses/by/3.0
attribution name: Historic England
in scheme: First World War Project
scope note: A place where boats are built and stored.
publisher: www.historicengland.org.uk
broader: Marine Construction Site
attribution URL: http://www.historicengland.org.uk

Dry Dock
type: Concept
alternative label: Graving Dock
attribution name: Historic England
issued: 2019-07-18T10:15:51
license: http://creativecommons.org/licenses/by/3.0
alternative label: Canal Dry Dock
in scheme: First World War Project
attribution URL: http://www.historicengland.org.uk
alternative label: Double Dock
publisher: www.historicengland.org.uk
broader: Marine Construction Site
related: Ship Repair Works
scope note: A stone-faced enclosure, with entrance closed by a floatable caisson or by gates, which can be pumped dry for inspection, maintenance, or repair of the hull or underwater fittings of a ship or ships.

Seaplane Factory
type: Concept
attribution name: Historic England
broader: Marine Construction Site
license: http://creativecommons.org/licenses/by/3.0
in scheme: First World War Project
attribution URL: http://www.historicengland.org.uk
broader: Aircraft Factory
scope note: A factory where seaplanes are manufactured.
publisher: www.historicengland.org.uk
issued: 2019-07-18T10:15:51

Wet Dock
type: Concept
in scheme: First World War Project
attribution URL: http://www.historicengland.org.uk
broader: Marine Construction Site
license: http://creativecommons.org/licenses/by/3.0
scope note: A large, watertight enclosure in which the water is maintained at the high-tide level so that vessels remain constantly afloat in them.
attribution name: Historic England
issued: 2019-07-18T10:15:51
publisher: www.historicengland.org.uk

Dockyard
type: Concept
alternative label: Dockyard Boundary Wall
attribution name: Historic England
related: Shipyard
alternative label: Docks
alternative label: Dockyard Stable
in scheme: First World War Project
license: http://creativecommons.org/licenses/by/3.0
broader: Marine Construction Site
narrower: Naval Dockyard
alternative label: Dockyard Office
issued: 2019-07-18T10:15:51
alternative label: Dockyard Gatehouse
publisher: www.historicengland.org.uk
attribution URL: http://www.historicengland.org.uk
alternative label: Dockyard Gate
related: Slip Shed
scope note: An enclosure in which ships are built and repaired, and all sorts of ships' stores are brought together.

Marine Engineering Works
type: Concept
attribution name: Historic England
in scheme: First World War Project
narrower: Fabrication Shed
related: Ship Repair Works
publisher: www.historicengland.org.uk
broader: Marine Construction Site
attribution URL: http://www.historicengland.org.uk
issued: 2019-07-18T10:15:51
scope note: Specialized engineering workshop particularly for the production of marine engines or other large components of ships.
license: http://creativecommons.org/licenses/by/3.0

Ship Breakers Yard
type: Concept
scope note: Place where ships and boats are dismantled.
attribution URL: http://www.historicengland.org.uk
in scheme: First World War Project
broader: Marine Construction Site
issued: 2019-07-18T10:15:51
license: http://creativecommons.org/licenses/by/3.0
attribution name: Historic England
publisher: www.historicengland.org.uk

Marine Workshop
type: Concept
narrower: Shipwrights Workshop
scope note: A craft or repair workshop in a boat yard, harbour or naval dockyard.
issued: 2019-07-18T10:15:51
attribution URL: http://www.historicengland.org.uk
publisher: www.historicengland.org.uk
related: Shipyard
in scheme: First World War Project
attribution name: Historic England
license: http://creativecommons.org/licenses/by/3.0
narrower: Slip Shed
broader: Marine Construction Site

Half Tide Dock
type: Concept
in scheme: First World War Project
publisher: www.historicengland.org.uk
broader: Marine Construction Site
attribution URL: http://www.historicengland.org.uk
scope note: A dock with gates which open for access for some hours before and after high water.
issued: 2019-07-18T10:15:51
attribution name: Historic England
license: http://creativecommons.org/licenses/by/3.0

Shipyard
type: Concept
scope note: A place where boats or ships are built or repaired.
issued: 2019-07-18T10:15:51
license: http://creativecommons.org/licenses/by/3.0
attribution URL: http://www.historicengland.org.uk
attribution name: Historic England
related: Dockyard
in scheme: First World War Project
publisher: www.historicengland.org.uk
broader: Marine Construction Site
related: Marine Workshop

Technical Site
type: Concept
issued: 2019-07-18T10:15:51
license: http://creativecommons.org/licenses/by/3.0
broader: Technical And Instructional Site
attribution name: Historic England
narrower: Vehicle Repair Centre
scope note: A site associated with the maintenance of military equipment and buildings.
attribution URL: http://www.historicengland.org.uk
narrower: Transformer Building
narrower: Control Building
publisher: www.historicengland.org.uk
in scheme: First World War Project

Vehicle Repair Centre
type: Concept
attribution URL: http://www.historicengland.org.uk
in scheme: First World War Project
issued: 2019-07-18T10:15:51
scope note: A building or site used for the maintenance and repair of motor vehicles.
attribution name: Historic England
publisher: www.historicengland.org.uk
broader: Technical Site
license: http://creativecommons.org/licenses/by/3.0

Transformer Building
type: Concept
attribution URL: http://www.historicengland.org.uk
issued: 2019-07-18T10:15:51
broader: Technical Site
in scheme: First World War Project
attribution name: Historic England
license: http://creativecommons.org/licenses/by/3.0
scope note: A building housing transformers to convert AC electricity supply for domestic use.
publisher: www.historicengland.org.uk

Control Building
type: Concept
in scheme: First World War Project
license: http://creativecommons.org/licenses/by/3.0
attribution URL: http://www.historicengland.org.uk
broader: Technical Site
attribution name: Historic England
issued: 2019-07-18T10:15:51
publisher: www.historicengland.org.uk

Trainer
type: Concept
scope note: An aircraft used for the training of pilots, sometimes fitted with dual controls for use by the instructor.
in scheme: First World War Project
broader: Aircraft <By Function>
license: http://creativecommons.org/licenses/by/3.0
publisher: www.historicengland.org.uk
issued: 2019-07-18T10:15:51
attribution URL: http://www.historicengland.org.uk
attribution name: Historic England
narrower: Armstrong Whitworth FK3

Armstrong Whitworth FK3
type: Concept
broader: Armstrong Whitworth
alternative label: Fk3
broader: Trainer
license: http://creativecommons.org/licenses/by/3.0
scope note: A two-seat, reconnaissance biplane developed from the FK2 with a more powerful, but heavier, engine. Primarily used for training in the UK.
attribution URL: http://www.historicengland.org.uk
broader: Reconnaissance
publisher: www.historicengland.org.uk
attribution name: Historic England
issued: 2019-07-18T10:15:51
in scheme: First World War Project
broader: Biplane

Avro
type: Concept
issued: 2019-07-18T10:15:51
attribution name: Historic England
scope note: A. V. Roe & Co., Ltd. formed in 1909.
narrower: Avro 504
in scheme: First World War Project
broader: Aircraft <By Manufacturer>
attribution URL: http://www.historicengland.org.uk
license: http://creativecommons.org/licenses/by/3.0
publisher: www.historicengland.org.uk

Avro 504
type: Concept
issued: 2019-07-18T10:15:51
broader: Avro
broader: Biplane
attribution name: Historic England
publisher: www.historicengland.org.uk
attribution URL: http://www.historicengland.org.uk
license: http://creativecommons.org/licenses/by/3.0
scope note: An important two-seat, tractor biplane, initially used by the RFC in a reconnaissance role and by the RNAS as a bomber. Later converted to a single-seat Home Defence fighter and ultimately used as a trainer.
in scheme: First World War Project

Anti Aircraft Gun Tower
type: Concept
license: http://creativecommons.org/licenses/by/3.0
scope note: A purpose-built firing platform on which an anti-aircraft battery could be emplaced.
attribution URL: http://www.historicengland.org.uk
publisher: www.historicengland.org.uk
attribution name: Historic England
issued: 2019-07-18T10:15:51
in scheme: First World War Project
broader: Anti Aircraft Defence Site

Anti Aircraft Defence Site
type: Concept
scope note: Sites, buildings and structures for the control and mounting of anti aircraft artillery. Also, structures for passive or indirect defence against enemy aircraft.
attribution URL: http://www.historicengland.org.uk
in scheme: First World War Project
issued: 2019-07-18T10:15:51
narrower: Barrage Balloon Site
narrower: Anti Aircraft Gun Tower
broader: Active Air Defence Site
license: http://creativecommons.org/licenses/by/3.0
narrower: Searchlight Battery
narrower: Anti Aircraft Battery
publisher: www.historicengland.org.uk
attribution name: Historic England

Seaplane Shed (Type J)
type: Concept
issued: 2019-07-18T10:15:51
in scheme: First World War Project
broader: Seaplane Shed
publisher: www.historicengland.org.uk
attribution URL: http://www.historicengland.org.uk
license: http://creativecommons.org/licenses/by/3.0
attribution name: Historic England
scope note: A steel framed seaplane hangar designed for Royal Navy Air Stations by the admiralty in 1917-1918.

Aircraft Type
type: Concept
narrower: Aircraft <By Form>
narrower: Aircraft Mark
license: http://creativecommons.org/licenses/by/3.0
in scheme: First World War Project
scope note: Types of aircraft to aid the recording of aircraft remains and crash sites, listing aircraft by form, function and manufacturer.
top concept of: First World War Project
attribution name: Historic England
publisher: www.historicengland.org.uk
narrower: Aircraft <By Manufacturer>
issued: 2019-07-18T10:15:51
attribution URL: http://www.historicengland.org.uk
narrower: Aircraft <By Function>

Billet
type: Concept
attribution name: Historic England
license: http://creativecommons.org/licenses/by/3.0
attribution URL: http://www.historicengland.org.uk
in scheme: First World War Project
publisher: www.historicengland.org.uk
broader: Ancillary Building
issued: 2019-07-18T10:15:51
scope note: Accommodation for military personnel.

Searchlight Battery
type: Concept
broader: Anti Aircraft Defence Site
attribution URL: http://www.historicengland.org.uk
narrower: Battery Observation Post
attribution name: Historic England
issued: 2019-07-18T10:15:51
license: http://creativecommons.org/licenses/by/3.0
in scheme: First World War Project
narrower: Searchlight Emplacement
publisher: www.historicengland.org.uk
scope note: A site in which one or more searchlights were positioned to locate enemy aircraft or surface vessels for the benefit of batteries and night fighter aircraft.
related: Battery Engine House

Searchlight Emplacement
type: Concept
issued: 2019-07-18T10:15:51
license: http://creativecommons.org/licenses/by/3.0
attribution URL: http://www.historicengland.org.uk
publisher: www.historicengland.org.uk
attribution name: Historic England
broader: Searchlight Battery
in scheme: First World War Project
scope note: A site in which one or more searchlights and their accompanying structures were positioned to locate enemy aircraft or surface vessels for the benefit of batteries and night fighter aircraft.

Airship
type: Concept
scope note: An aircraft lifted by gas bags, containing hydrogen or helium, but propelled by engines. Also known as a dirigible balloon, firm and streamlined in shape and incapable of high speeds. Used extensively during the First World War.
narrower: Zeppelin
attribution URL: http://www.historicengland.org.uk
in scheme: First World War Project
broader: Aircraft <By Form>
issued: 2019-07-18T10:15:51
license: http://creativecommons.org/licenses/by/3.0
attribution name: Historic England
publisher: www.historicengland.org.uk

Zeppelin
type: Concept
license: http://creativecommons.org/licenses/by/3.0
attribution URL: http://www.historicengland.org.uk
publisher: www.historicengland.org.uk
attribution name: Historic England
issued: 2019-07-18T10:15:51
broader: Airship
in scheme: First World War Project
scope note: A rigid frame type of airship pioneered by Count Zeppelin and used by the Germans in FWW for military purposes: do not use asa generic name for airships.

Press House
type: Concept
license: http://creativecommons.org/licenses/by/3.0
broader: Gunpowder Manufacturing Site
attribution URL: http://www.historicengland.org.uk
in scheme: First World War Project
alternative label: Cordite Press House
issued: 2019-07-18T10:15:51
attribution name: Historic England
publisher: www.historicengland.org.uk
scope note: A building containing presses for the compaction of mill cake gunpowder as part of the gunpowder manufacturing process.

MkI
type: Concept
publisher: www.historicengland.org.uk
in scheme: First World War Project
broader: Aircraft Mark
alternative label: Mk1
attribution URL: http://www.historicengland.org.uk
scope note: Mark 1 or the first production variation of an aircraft.
license: http://creativecommons.org/licenses/by/3.0
attribution name: Historic England
issued: 2019-07-18T10:15:51

Felixstowe
type: Concept
scope note: Marine Aircraft Experimental Establishment, RAF Felixstowe. Developed seaplanes and flying boats until World War Two, when the establishment moved to Helensburg, Scotland.
issued: 2019-07-18T10:15:51
license: http://creativecommons.org/licenses/by/3.0
attribution name: Historic England
broader: Aircraft <By Manufacturer>
in scheme: First World War Project
publisher: www.historicengland.org.uk
attribution URL: http://www.historicengland.org.uk

Vickers Machine Gun Emplacement
type: Concept
in scheme: First World War Project
scope note: A square, concrete pillbox-like structure with 36in thick walls and a single large embrasure used to emplace a Vickers Medium Machine Gun. The entrance was protected by an external blast wall.
attribution URL: http://www.historicengland.org.uk
broader: Machine Gun Emplacement
publisher: www.historicengland.org.uk
attribution name: Historic England
issued: 2019-07-18T10:15:51
license: http://creativecommons.org/licenses/by/3.0

Machine Gun Emplacement
type: Concept
publisher: www.historicengland.org.uk
narrower: Machine Gun Post
license: http://creativecommons.org/licenses/by/3.0
attribution URL: http://www.historicengland.org.uk
issued: 2019-07-18T10:15:51
narrower: Vickers Machine Gun Emplacement
attribution name: Historic England
scope note: A structure, usually or concrete or sandbags, in which a machine gun was emplaced.
in scheme: First World War Project
broader: Gun Emplacement

MkIIC
type: Concept
issued: 2019-07-18T10:15:51
license: http://creativecommons.org/licenses/by/3.0
attribution name: Historic England
in scheme: First World War Project
publisher: www.historicengland.org.uk
scope note: A Mark 2B aircraft which has undergone slight modifications to enhance performance or armament.
attribution URL: http://www.historicengland.org.uk
broader: Aircraft Mark

Radio Mast
type: Concept
issued: 2019-07-18T10:15:51
in scheme: First World War Project
attribution URL: http://www.historicengland.org.uk
scope note: A tall, usually steel, structure used to receive and transmit radio signals.
attribution name: Historic England
broader: Radio Station
license: http://creativecommons.org/licenses/by/3.0
publisher: www.historicengland.org.uk

Officers Quarters
type: Concept
license: http://creativecommons.org/licenses/by/3.0
broader: Ancillary Building
attribution URL: http://www.historicengland.org.uk
publisher: www.historicengland.org.uk
attribution name: Historic England
issued: 2019-07-18T10:15:51
in scheme: First World War Project
scope note: A building where military officers are accommodated.

Sabulite Factory
type: Concept
license: http://creativecommons.org/licenses/by/3.0
attribution name: Historic England
issued: 2019-07-18T10:15:51
scope note: A factory or works principally engaged in the manufacture of the mining explosive sabulite.
in scheme: First World War Project
publisher: www.historicengland.org.uk
attribution URL: http://www.historicengland.org.uk
broader: Explosives Factory

Remount Depot
type: Concept
in scheme: First World War Project
attribution URL: http://www.historicengland.org.uk
license: http://creativecommons.org/licenses/by/3.0
broader: Depot
attribution name: Historic England
issued: 2019-07-18T10:15:51
scope note: A building or site used as a distribution centre for Army horses/ remounts and mules.
publisher: www.historicengland.org.uk

Watch Office
type: Concept
publisher: www.historicengland.org.uk
license: http://creativecommons.org/licenses/by/3.0
attribution URL: http://www.historicengland.org.uk
broader: Control Tower
issued: 2019-07-18T10:15:51
attribution name: Historic England
scope note: A building, originally used as a shelter for the duty pilot or officer on watch on an airfield, and later used to direct air traffic. Use more specific type where known.
in scheme: First World War Project

Control Tower
type: Concept
attribution name: Historic England
narrower: Watch Office
license: http://creativecommons.org/licenses/by/3.0
scope note: A building at an airfield from which air traffic can be controlled, usually by radio.
in scheme: First World War Project
publisher: www.historicengland.org.uk
broader: Airfield Site
attribution URL: http://www.historicengland.org.uk
issued: 2019-07-18T10:15:51

Gun Emplacement (Type 55422)
type: Concept
in scheme: First World War Project
attribution URL: http://www.historicengland.org.uk
license: http://creativecommons.org/licenses/by/3.0
broader: Gun Emplacement
attribution name: Historic England
scope note: A gun emplacement which conforms to Department of Fortification and Works drawing number 55422.
issued: 2019-07-18T10:15:51
publisher: www.historicengland.org.uk

Guncotton Factory
type: Concept
attribution name: Historic England
related: Cordite Factory
broader: Explosives Factory
in scheme: First World War Project
alternative label: Gun Cotton Mill
publisher: www.historicengland.org.uk
scope note: A factory or works engaged in the manufacture of the explosive guncotton. They may be found as separate factories or form part of a cordite factory.
attribution URL: http://www.historicengland.org.uk
issued: 2019-07-18T10:15:51
license: http://creativecommons.org/licenses/by/3.0

Cordite Factory
type: Concept
scope note: A factory principally engaged in the manufacture of the propellant explosive cordite.
attribution URL: http://www.historicengland.org.uk
broader: Explosives Factory
in scheme: First World War Project
related: Guncotton Factory
issued: 2019-07-18T10:15:51
license: http://creativecommons.org/licenses/by/3.0
attribution name: Historic England
publisher: www.historicengland.org.uk

Holdfast
type: Concept
scope note: A plinth or pedestal, usually of concrete, to which an anti aircraft or coastal battery gun was fitted. Holdfasts are often the only evidence for a weapon which survive.
issued: 2019-07-18T10:15:51
attribution name: Historic England
attribution URL: http://www.historicengland.org.uk
broader: Gun Emplacement
publisher: www.historicengland.org.uk
license: http://creativecommons.org/licenses/by/3.0
in scheme: First World War Project

Testing Range
type: Concept
attribution URL: http://www.historicengland.org.uk
alternative label: Underground Testing Range
issued: 2019-07-18T10:15:51
scope note: A site, containing installations and machinery, used for measuring the power of explosives.
attribution name: Historic England
license: http://creativecommons.org/licenses/by/3.0
in scheme: First World War Project
broader: Explosives Manufacturing Site
publisher: www.historicengland.org.uk

Training Site
type: Concept
broader: Military Defence And Fortification
in scheme: First World War Project
narrower: Training Area
narrower: Training Centre
narrower: Training Camp
attribution URL: http://www.historicengland.org.uk
scope note: A site used for military training. Use more specific term.
narrower: Training Base
publisher: www.historicengland.org.uk
attribution name: Historic England
issued: 2019-07-18T10:15:51
license: http://creativecommons.org/licenses/by/3.0

Training Area
type: Concept
broader: Training Site
attribution name: Historic England
issued: 2019-07-18T10:15:51
attribution URL: http://www.historicengland.org.uk
publisher: www.historicengland.org.uk
narrower: Grenade Range
scope note: A designated area of land, usually closed to the public, used for military exercises and training purposes.
in scheme: First World War Project
related: Requisitioned Land
narrower: Firing Range
license: http://creativecommons.org/licenses/by/3.0

Training Centre
type: Concept
attribution name: Historic England
in scheme: First World War Project
issued: 2019-07-18T10:15:51
publisher: www.historicengland.org.uk
attribution URL: http://www.historicengland.org.uk
license: http://creativecommons.org/licenses/by/3.0
scope note: A place where specific skills are taught on short courses
broader: Training Site

Training Camp
type: Concept
broader: Training Site
attribution name: Historic England
broader: Military Camp
in scheme: First World War Project
publisher: www.historicengland.org.uk
scope note: A military camp providing training facilities.
attribution URL: http://www.historicengland.org.uk
issued: 2019-07-18T10:15:51
license: http://creativecommons.org/licenses/by/3.0

Antenna Array
type: Concept
issued: 2019-07-18T10:15:51
attribution URL: http://www.historicengland.org.uk
attribution name: Historic England
scope note: A structure used for the transmission and interception of radio signals. Usually composed of a number of different elements such as aerials, receiving equipment and supporting pylons.
broader: Passive Air Defence Site
license: http://creativecommons.org/licenses/by/3.0
publisher: www.historicengland.org.uk
in scheme: First World War Project

Passive Air Defence Site
type: Concept
publisher: www.historicengland.org.uk
narrower: Sound Mirror Building
narrower: Antenna Array
license: http://creativecommons.org/licenses/by/3.0
in scheme: First World War Project
scope note: Sites, buildings or structures involved in passive air defence, usually by forcing hostile aircraft to fly high or drop their bombs on the wrong targets. Use more specific term.
narrower: Listening Post
issued: 2019-07-18T10:15:51
narrower: Sound Mirror
attribution name: Historic England
broader: Air Defence Site
attribution URL: http://www.historicengland.org.uk

De Havilland
type: Concept
issued: 2019-07-18T10:15:51
in scheme: First World War Project
attribution URL: http://www.historicengland.org.uk
attribution name: Historic England
broader: Aircraft <By Manufacturer>
scope note: The de Havilland Aircraft Co, Ltd.
license: http://creativecommons.org/licenses/by/3.0
publisher: www.historicengland.org.uk

Air Defence Site
type: Concept
attribution URL: http://www.historicengland.org.uk
issued: 2019-07-18T10:15:51
broader: Defence Site
scope note: A site equipped for passive or active defence against an airborne enemy assault.
publisher: www.historicengland.org.uk
attribution name: Historic England
license: http://creativecommons.org/licenses/by/3.0
in scheme: First World War Project
narrower: Passive Air Defence Site
narrower: Active Air Defence Site

Active Air Defence Site
type: Concept
publisher: www.historicengland.org.uk
issued: 2019-07-18T10:15:51
in scheme: First World War Project
license: http://creativecommons.org/licenses/by/3.0
broader: Air Defence Site
narrower: Anti Aircraft Defence Site
attribution name: Historic England
attribution URL: http://www.historicengland.org.uk
scope note: A site equipped for active defensive action against an airborne enemy assault.

Toluene Works
type: Concept
attribution URL: http://www.historicengland.org.uk
scope note: A chemical works engaged in the production or refining of toluene, a substance extracted from coal tar or specific types of crude oil, and used in the production of explosives during WW1.
alternative label: Toluol Works
broader: Explosives Factory
publisher: www.historicengland.org.uk
in scheme: First World War Project
license: http://creativecommons.org/licenses/by/3.0
attribution name: Historic England
issued: 2019-07-18T10:15:51

Camouflage
type: Concept
in scheme: First World War Project
attribution URL: http://www.historicengland.org.uk
license: http://creativecommons.org/licenses/by/3.0
scope note: The surviving remnants of material used to disguise the existence of a building or site. Use with specific monument type where known.
attribution name: Historic England
broader: Military Site
issued: 2019-07-18T10:15:51
publisher: www.historicengland.org.uk

Fire Service Headquarters
type: Concept
license: http://creativecommons.org/licenses/by/3.0
attribution name: Historic England
scope note: A building, either purpose-built or modified, used for the co-ordination of the Fire Service.
in scheme: First World War Project
issued: 2019-07-18T10:15:51
publisher: www.historicengland.org.uk
broader: Civil Defence Building
attribution URL: http://www.historicengland.org.uk

Civil Defence Building
type: Concept
issued: 2019-07-18T10:15:51
publisher: www.historicengland.org.uk
license: http://creativecommons.org/licenses/by/3.0
in scheme: First World War Project
scope note: A building used to coordinate civil defence in times of war. Can also be utilized as aid centres in times of national emergency.
narrower: Fire Service Headquarters
broader: Civil Defence Site
attribution name: Historic England
narrower: Civil Defence Headquarters
attribution URL: http://www.historicengland.org.uk

Fuel Depot
type: Concept
broader: Depot
issued: 2019-07-18T10:15:51
attribution name: Historic England
publisher: www.historicengland.org.uk
scope note: A building or site used for the storage and distribution of fuel.
license: http://creativecommons.org/licenses/by/3.0
attribution URL: http://www.historicengland.org.uk
in scheme: First World War Project

Torpedo Range Control Building
type: Concept
attribution URL: http://www.historicengland.org.uk
attribution name: Historic England
issued: 2019-07-18T10:15:51
in scheme: First World War Project
broader: Torpedo Range
publisher: www.historicengland.org.uk
license: http://creativecommons.org/licenses/by/3.0
scope note: A building from which the firing of torpedoes can be controlled and evaluated.

Torpedo Range
type: Concept
attribution name: Historic England
license: http://creativecommons.org/licenses/by/3.0
issued: 2019-07-18T10:15:51
narrower: Torpedo Range Control Building
in scheme: First World War Project
publisher: www.historicengland.org.uk
attribution URL: http://www.historicengland.org.uk
broader: Firing Range
scope note: A designated area of water in which the performance of torpedoes can be evaluated.

Airfield Building
type: Concept
publisher: www.historicengland.org.uk
license: http://creativecommons.org/licenses/by/3.0
scope note: A building found on, or associated with, an airfield.
attribution URL: http://www.historicengland.org.uk
attribution name: Historic England
narrower: Quadrant Tower
broader: Ancillary Building
in scheme: First World War Project
issued: 2019-07-18T10:15:51

Quadrant Tower
type: Concept
scope note: An observation tower on a bombing range from which an observer could watch the bombing runs and report back to the aircraft on their accuracy.
license: http://creativecommons.org/licenses/by/3.0
publisher: www.historicengland.org.uk
broader: Airfield Building
issued: 2019-07-18T10:15:51
attribution URL: http://www.historicengland.org.uk
attribution name: Historic England
in scheme: First World War Project

Displaced Persons Camp
type: Concept
issued: 2019-07-18T10:15:51
attribution name: Historic England
scope note: A camp where people who fled from danger or problem whithin their country or across international borders and who are in need of international protection are temporarily placed.
broader: Military Defence And Fortification
attribution URL: http://www.historicengland.org.uk
license: http://creativecommons.org/licenses/by/3.0
publisher: www.historicengland.org.uk
in scheme: First World War Project

Civil Defence Headquarters
type: Concept
in scheme: First World War Project
broader: Civil Defence Building
attribution URL: http://www.historicengland.org.uk
license: http://creativecommons.org/licenses/by/3.0
issued: 2019-07-18T10:15:51
publisher: www.historicengland.org.uk
attribution name: Historic England
scope note: A building used for the daily administration of Civil Defence activities.

Beach Defence Light
type: Concept
scope note: A searchlight battery used to light a beach.
attribution URL: http://www.historicengland.org.uk
attribution name: Historic England
issued: 2019-07-18T10:15:51
license: http://creativecommons.org/licenses/by/3.0
in scheme: First World War Project
publisher: www.historicengland.org.uk
related: Coast Artillery Searchlight
broader: Coastal Defence Site

Royal Flying Corps Aircraft Hangar
type: Concept
broader: Aircraft Hangar
in scheme: First World War Project
issued: 2019-07-18T10:15:51
attribution URL: http://www.historicengland.org.uk
license: http://creativecommons.org/licenses/by/3.0
attribution name: Historic England
publisher: www.historicengland.org.uk
narrower: RFC Side Opening Aircraft Hangar
alternative label: Royal Flying Corps Aeroplane Shed
scope note: The earliest side-opening standard type of aircraft hangar designed in 1913 and used in WWI. Originally constructed from wooden trusses and struts, some examples have steel frames. It comprised a single or coupled shed with rear workshops.

RFC Side Opening Aircraft Hangar
type: Concept
license: http://creativecommons.org/licenses/by/3.0
attribution name: Historic England
alternative label: Royal Flying Corps Side Opening Aircraft Hangar
in scheme: First World War Project
publisher: www.historicengland.org.uk
broader: Royal Flying Corps Aircraft Hangar
issued: 2019-07-18T10:15:51
scope note: The earliest side-opening standard type of aircraft hangar designed in 1913 and used in WWI. Originally constructed from wooden trusses and struts, one example has steel frames. It comprised a single or coupled shed with rear workshops.
attribution URL: http://www.historicengland.org.uk

Fuel Store
type: Concept
issued: 2019-07-18T10:15:51
scope note: A building used for the storage of materials used to provide power or heat.
attribution URL: http://www.historicengland.org.uk
attribution name: Historic England
narrower: Fuel Tank
license: http://creativecommons.org/licenses/by/3.0
broader: Storage Facility
publisher: www.historicengland.org.uk
in scheme: First World War Project

Fuel Tank
type: Concept
in scheme: First World War Project
license: http://creativecommons.org/licenses/by/3.0
scope note: A large, usually metal, container used for the storage of liquid fuels.
attribution URL: http://www.historicengland.org.uk
issued: 2019-07-18T10:15:51
attribution name: Historic England
publisher: www.historicengland.org.uk
broader: Fuel Store

Storage Facility
type: Concept
attribution URL: http://www.historicengland.org.uk
scope note: Sites and buildings used for the storage or equipment, ordnance or vehicles. Use more specific term.
narrower: Explosives Storage Facility
in scheme: First World War Project
narrower: Fuel Store
narrower: Depot
attribution name: Historic England
publisher: www.historicengland.org.uk
narrower: Storage Building
narrower: Chemical Weapons Store
narrower: Art Storage Facility
narrower: Vehicle Park
issued: 2019-07-18T10:15:51
license: http://creativecommons.org/licenses/by/3.0
broader: Airfield Site
narrower: Water Storage Facility

Ammonium Nitrate Works
type: Concept
in scheme: First World War Project
attribution URL: http://www.historicengland.org.uk
scope note: A chemical works engaged in the production of Ammonium Nitrate, used as a fertilizer or for use in the explosives industry.
broader: Explosives Factory
license: http://creativecommons.org/licenses/by/3.0
attribution name: Historic England
issued: 2019-07-18T10:15:51
publisher: www.historicengland.org.uk

Wall Monument
type: Concept
issued: 2019-07-18T10:15:51
publisher: www.historicengland.org.uk
broader: Commemorative Monument
in scheme: First World War Project
scope note: A substantial monument attached to a wall and often standing on the floor.
attribution name: Historic England
license: http://creativecommons.org/licenses/by/3.0
attribution URL: http://www.historicengland.org.uk

Gunpowder Drying House
type: Concept
related: Reel Drying Stove
broader: Gunpowder Manufacturing Site
license: http://creativecommons.org/licenses/by/3.0
related: Guncotton Stove
attribution name: Historic England
in scheme: First World War Project
publisher: www.historicengland.org.uk
attribution URL: http://www.historicengland.org.uk
scope note: A processing house where surplus water is removed from gunpowder after incorporating.
issued: 2019-07-18T10:15:51

Reel Drying Stove
type: Concept
in scheme: First World War Project
license: http://creativecommons.org/licenses/by/3.0
issued: 2019-07-18T10:15:51
broader: Explosives Manufacturing Site
related: Gunpowder Drying House
related: Guncotton Stove
attribution URL: http://www.historicengland.org.uk
scope note: A structure or building used in the manufacture of the explosive cordite. After the cordite had been pressed to extract moisture it was placed on racks within the stove prior to being taken to the reeling house for winding.
attribution name: Historic England
publisher: www.historicengland.org.uk
alternative label: Cordite Drying Stove

Guncotton Stove
type: Concept
issued: 2019-07-18T10:15:51
attribution name: Historic England
related: Reel Drying Stove
scope note: A building in which moist guncotton is dried by warm air for use in nitroglycerine manufacture.
broader: Explosives Manufacturing Site
in scheme: First World War Project
attribution URL: http://www.historicengland.org.uk
license: http://creativecommons.org/licenses/by/3.0
related: Gunpowder Drying House
publisher: www.historicengland.org.uk

Effigy
type: Concept
in scheme: First World War Project
broader: Commemorative Monument
attribution URL: http://www.historicengland.org.uk
license: http://creativecommons.org/licenses/by/3.0
issued: 2019-07-18T10:15:51
scope note: A sculptured likeness, portrait or image, often found on a tomb or other memorial.
attribution name: Historic England
alternative label: Memorial Effigy
publisher: www.historicengland.org.uk

Weapons Pit
type: Concept
attribution URL: http://www.historicengland.org.uk
scope note: Usually a small, two or three man trench, dug as an isolated fieldwork rather than as part of a defensive system. A WWI and WWII feature.
issued: 2019-07-18T10:15:51
attribution name: Historic England
license: http://creativecommons.org/licenses/by/3.0
broader: Fieldwork
in scheme: First World War Project
publisher: www.historicengland.org.uk

Mess
type: Concept
attribution URL: http://www.historicengland.org.uk
in scheme: First World War Project
issued: 2019-07-18T10:15:51
license: http://creativecommons.org/licenses/by/3.0
attribution name: Historic England
narrower: Sergeants Mess
narrower: Officers Mess
broader: Ancillary Building
publisher: www.historicengland.org.uk
scope note: A building providing dining and recreation facilities for military personnel.

Sergeants Mess
type: Concept
license: http://creativecommons.org/licenses/by/3.0
in scheme: First World War Project
attribution URL: http://www.historicengland.org.uk
broader: Mess
issued: 2019-07-18T10:15:51
publisher: www.historicengland.org.uk
attribution name: Historic England
scope note: A building providing dining facilities and recreation for non-commissioned officers.

Officers Mess
type: Concept
in scheme: First World War Project
attribution name: Historic England
issued: 2019-07-18T10:15:51
publisher: www.historicengland.org.uk
license: http://creativecommons.org/licenses/by/3.0
attribution URL: http://www.historicengland.org.uk
scope note: A building providing dining facilities and recreation for commissioned officers.
broader: Mess

Explosives Storage Facility
type: Concept
issued: 2019-07-18T10:15:51
license: http://creativecommons.org/licenses/by/3.0
scope note: A site, building or structure used for the storage of explosives.
attribution name: Historic England
in scheme: First World War Project
attribution URL: http://www.historicengland.org.uk
broader: Storage Facility
publisher: www.historicengland.org.uk

MkIF
type: Concept
in scheme: First World War Project
broader: Aircraft Mark
attribution name: Historic England
issued: 2019-07-18T10:15:51
scope note: A Mark 1E aircraft which has undergone further modifications to enhance performance or armament.
publisher: www.historicengland.org.uk
attribution URL: http://www.historicengland.org.uk
license: http://creativecommons.org/licenses/by/3.0

Cordite Incorporating House
type: Concept
scope note: A building in which cordite paste is blended with the solvent acetone and Vaseline to form a cordite dough.
in scheme: First World War Project
license: http://creativecommons.org/licenses/by/3.0
publisher: www.historicengland.org.uk
issued: 2019-07-18T10:15:51
broader: Explosives Manufacturing Site
attribution URL: http://www.historicengland.org.uk
attribution name: Historic England

Headquarters
type: Concept
issued: 2019-07-18T10:15:51
attribution URL: http://www.historicengland.org.uk
attribution name: Historic England
scope note: A building used for the daily administration of an organisation or military force.
in scheme: First World War Project
license: http://creativecommons.org/licenses/by/3.0
publisher: www.historicengland.org.uk
broader: Military Defence And Fortification

Communications
type: Concept
attribution URL: http://www.historicengland.org.uk
issued: 2019-07-18T10:15:51
in scheme: First World War Project
attribution name: Historic England
license: http://creativecommons.org/licenses/by/3.0
scope note: An aircraft used to facilitate communications, for example in a military context.
broader: Aircraft <By Function>
publisher: www.historicengland.org.uk

MkII
type: Concept
issued: 2019-07-18T10:15:51
broader: Aircraft Mark
attribution name: Historic England
publisher: www.historicengland.org.uk
in scheme: First World War Project
license: http://creativecommons.org/licenses/by/3.0
attribution URL: http://www.historicengland.org.uk
scope note: Mark 2 or the second variant of an aircraft with its associated modifications.

Bomb Site
type: Concept
publisher: www.historicengland.org.uk
in scheme: First World War Project
scope note: A site which has been bombed but where there is no crater, eg. bombed buildings.
attribution URL: http://www.historicengland.org.uk
license: http://creativecommons.org/licenses/by/3.0
issued: 2019-07-18T10:15:51
attribution name: Historic England
broader: Unassigned

Anti Aircraft Battery Command Post
type: Concept
issued: 2019-07-18T10:15:51
attribution name: Historic England
attribution URL: http://www.historicengland.org.uk
broader: Command Post
publisher: www.historicengland.org.uk
in scheme: First World War Project
license: http://creativecommons.org/licenses/by/3.0
broader: Anti Aircraft Battery
scope note: A command post used to direct the guns of an anti aircraft battery.

Command Post
type: Concept
issued: 2019-07-18T10:15:51
in scheme: First World War Project
attribution URL: http://www.historicengland.org.uk
narrower: Anti Aircraft Battery Command Post
publisher: www.historicengland.org.uk
broader: Ancillary Building
license: http://creativecommons.org/licenses/by/3.0
narrower: Coastal Battery Command Post
attribution name: Historic England
scope note: A building used for directing the movements of artillery pieces or searchlights. Use more specific term where known.

Anti Aircraft Battery
type: Concept
in scheme: First World War Project
license: http://creativecommons.org/licenses/by/3.0
attribution name: Historic England
narrower: Anti Aircraft Gun Emplacement
scope note: A site containing one or more artillery pieces and/or rocket launchers for firing at enemy aircraft.
issued: 2019-07-18T10:15:51
narrower: Battery Observation Post
publisher: www.historicengland.org.uk
attribution URL: http://www.historicengland.org.uk
related: Battery Engine House
narrower: Anti Aircraft Battery Command Post
narrower: Heavy Anti Aircraft Battery
broader: Anti Aircraft Defence Site

Breaking Down House
type: Concept
attribution name: Historic England
license: http://creativecommons.org/licenses/by/3.0
attribution URL: http://www.historicengland.org.uk
in scheme: First World War Project
publisher: www.historicengland.org.uk
scope note: A building within a gunpowder works complex, where the mill cake (pulverised and incorporated ingredients of gunpowder) was broken down. It was crushed or broken down by passing it between pairs of revolving gunmetal rollers in a breaking-down machine.
related: Dusting House
broader: Gunpowder Works
issued: 2019-07-18T10:15:51

Dusting House
type: Concept
license: http://creativecommons.org/licenses/by/3.0
attribution name: Historic England
related: Breaking Down House
scope note: A building within the gunpowder works complex. During the gunpowder production process, the mill cake was broken down, pressed and then corned. The remaining dust was removed from the corned powder by tumbling it in gauze-covered revolving cylinders.
in scheme: First World War Project
publisher: www.historicengland.org.uk
issued: 2019-07-18T10:15:51
broader: Gunpowder Works
attribution URL: http://www.historicengland.org.uk

Gunpowder Works
type: Concept
related: Saltpetre Works
broader: Gunpowder Manufacturing Site
scope note: A site used for the manufacture of gunpowder.
narrower: Dusting House
in scheme: First World War Project
narrower: Breaking Down House
alternative label: Gunpowder Factory
license: http://creativecommons.org/licenses/by/3.0
attribution name: Historic England
issued: 2019-07-18T10:15:51
publisher: www.historicengland.org.uk
alternative label: Gunpowder Mill
attribution URL: http://www.historicengland.org.uk
alternative label: Powder Mill

Sound Mirror (200 Feet)
type: Concept
attribution URL: http://www.historicengland.org.uk
in scheme: First World War Project
issued: 2019-07-18T10:15:51
license: http://creativecommons.org/licenses/by/3.0
attribution name: Historic England
publisher: www.historicengland.org.uk
broader: Sound Mirror
scope note: A concrete, concave wall 200 feet in length used as an acoustic listening device to detect approaching enemy aircraft.

Anti Submarine Defence
type: Concept
publisher: www.historicengland.org.uk
license: http://creativecommons.org/licenses/by/3.0
attribution name: Historic England
scope note: Defence sites and structures including passive and active defences such as netting, chain booms and mines designed to prevent submarines approaching strategic ports.
attribution URL: http://www.historicengland.org.uk
broader: Anti Invasion Defence Site
in scheme: First World War Project
issued: 2019-07-18T10:15:51

Light Aircraft
type: Concept
publisher: www.historicengland.org.uk
broader: Aircraft <By Form>
license: http://creativecommons.org/licenses/by/3.0
in scheme: First World War Project
issued: 2019-07-18T10:15:51
attribution name: Historic England
attribution URL: http://www.historicengland.org.uk
scope note: Generally understood to mean aircraft whose normal loaded weight is less than 2750kg (6060lb).

Canadian Forestry Corps Camp
type: Concept
issued: 2019-07-18T10:15:51
attribution URL: http://www.historicengland.org.uk
attribution name: Historic England
scope note: A camp providing accommodation for members of the Canadian Forestry Corps along with facilities such as saw mills for the sawing and squaring of timber to create pit props, shoring, crates etc for the war effort.
in scheme: First World War Project
broader: Military Camp
license: http://creativecommons.org/licenses/by/3.0
publisher: www.historicengland.org.uk

Commemorative Stone
type: Concept
narrower: Date Stone
license: http://creativecommons.org/licenses/by/3.0
broader: Commemorative Monument
alternative label: Memorial Stone
in scheme: First World War Project
related: Gravestone
narrower: Dedication Stone
attribution name: Historic England
scope note: A stone commemorating a person or event.
issued: 2019-07-18T10:15:51
publisher: www.historicengland.org.uk
attribution URL: http://www.historicengland.org.uk

Dedication Stone
type: Concept
attribution name: Historic England
license: http://creativecommons.org/licenses/by/3.0
broader: Commemorative Stone
in scheme: First World War Project
publisher: www.historicengland.org.uk
scope note: A commemorative stone inscribed with a dedicatory inscription to a person or event.
attribution URL: http://www.historicengland.org.uk
issued: 2019-07-18T10:15:51

Observation Post
type: Concept
license: http://creativecommons.org/licenses/by/3.0
narrower: Battery Observation Post
narrower: Coastal Observation Post
attribution URL: http://www.historicengland.org.uk
in scheme: First World War Project
broader: Ancillary Building
issued: 2019-07-18T10:15:51
attribution name: Historic England
publisher: www.historicengland.org.uk
scope note: A building or site for watching specific military activities or the movement of enemy forces, etc.
narrower: Bombing Range Observation Post

Coastal Observation Post
type: Concept
license: http://creativecommons.org/licenses/by/3.0
attribution URL: http://www.historicengland.org.uk
broader: Observation Post
issued: 2019-07-18T10:15:51
attribution name: Historic England
narrower: Minewatchers Post
in scheme: First World War Project
scope note: A building, situated on the coast, used for observing the movements of shipping.
publisher: www.historicengland.org.uk
broader: Coastal Defence Site

Bombing Range Observation Post
type: Concept
attribution name: Historic England
scope note: An observation post located on or close to a bombing range.
license: http://creativecommons.org/licenses/by/3.0
broader: Observation Post
in scheme: First World War Project
issued: 2019-07-18T10:15:51
attribution URL: http://www.historicengland.org.uk
publisher: www.historicengland.org.uk

Stand By Set House
type: Concept
publisher: www.historicengland.org.uk
license: http://creativecommons.org/licenses/by/3.0
broader: Power Generation Site
attribution URL: http://www.historicengland.org.uk
scope note: A building housing the stand-by generator set and associated equipment which could supply electricity to all essential services in the event of a power cut.
issued: 2019-07-18T10:15:51
attribution name: Historic England
in scheme: First World War Project

Handly Page
type: Concept
in scheme: First World War Project
broader: Aircraft <By Manufacturer>
scope note: Handley Page, Ltd.. Founded by Sir Frederick Handley Page, this was the first limited company to be incorporated in Great Britain for the purpose of aircraft manufacture.
attribution URL: http://www.historicengland.org.uk
license: http://creativecommons.org/licenses/by/3.0
narrower: V1500
issued: 2019-07-18T10:15:51
attribution name: Historic England
publisher: www.historicengland.org.uk

V1500
type: Concept
issued: 2019-07-18T10:15:51
scope note: Four-engined, five to seven crew, heavy bomber biplane. Entered service in 1918.
attribution URL: http://www.historicengland.org.uk
attribution name: Historic England
broader: Heavy Bomber
broader: Biplane
broader: Handly Page
license: http://creativecommons.org/licenses/by/3.0
publisher: www.historicengland.org.uk
in scheme: First World War Project

Ammonium Perchlorate Works
type: Concept
in scheme: First World War Project
issued: 2019-07-18T10:15:51
scope note: A chemical works engaged in the production of Ammonium Perchlorate, a product used in the explosives industry.
attribution URL: http://www.historicengland.org.uk
license: http://creativecommons.org/licenses/by/3.0
attribution name: Historic England
publisher: www.historicengland.org.uk
broader: Explosives Factory

Admiralty Signal Establishment
type: Concept
attribution URL: http://www.historicengland.org.uk
attribution name: Historic England
issued: 2019-07-18T10:15:51
publisher: www.historicengland.org.uk
in scheme: First World War Project
broader: Military Defence And Fortification
license: http://creativecommons.org/licenses/by/3.0
scope note: A building or site conducting research into communication techniques for use in the Royal Navy.

Test Aircraft
type: Concept
attribution URL: http://www.historicengland.org.uk
in scheme: First World War Project
issued: 2019-07-18T10:15:51
license: http://creativecommons.org/licenses/by/3.0
attribution name: Historic England
publisher: www.historicengland.org.uk
scope note: An aircraft designed for the testing of engines or other aircraft components.
broader: Aircraft <By Function>

Reception Centre
type: Concept
attribution name: Historic England
issued: 2019-07-18T10:15:51
in scheme: First World War Project
publisher: www.historicengland.org.uk
attribution URL: http://www.historicengland.org.uk
license: http://creativecommons.org/licenses/by/3.0
broader: Ancillary Building

Gotha Gv
type: Concept
issued: 2019-07-18T10:15:51
publisher: www.historicengland.org.uk
broader: Gotha
license: http://creativecommons.org/licenses/by/3.0
attribution URL: http://www.historicengland.org.uk
broader: Heavy Bomber
broader: Biplane
attribution name: Historic England
scope note: A First World War German three-crew, twinengined, long range heavy bomber biplane manufactured by Gothaer Waggonfabrik A.G. Entering service in 1917, this aircraft incorporated a ventral tunnel allowing the gunner to shoot downwards and to the rear.
in scheme: First World War Project

Gotha
type: Concept
in scheme: First World War Project
license: http://creativecommons.org/licenses/by/3.0
issued: 2019-07-18T10:15:51
scope note: Gothauer Waggonfabrik A.G., based in Gotha, Thuringia (Germany).
attribution URL: http://www.historicengland.org.uk
attribution name: Historic England
publisher: www.historicengland.org.uk
narrower: Gotha Gv
broader: Aircraft <By Manufacturer>

Saltpetre Works
type: Concept
related: Gunpowder Works
broader: Explosives Factory
broader: Gunpowder Manufacturing Site
scope note: A building, factory or works which was engaged in the manufacture of refining saltpetre. Often part of a gunpowder works.
license: http://creativecommons.org/licenses/by/3.0
attribution URL: http://www.historicengland.org.uk
related: Nitre Bed
publisher: www.historicengland.org.uk
attribution name: Historic England
issued: 2019-07-18T10:15:51
in scheme: First World War Project

Nitre Bed
type: Concept
issued: 2019-07-18T10:15:51
attribution URL: http://www.historicengland.org.uk
attribution name: Historic England
scope note: A large bed surrounded by an earthwork and filled with composing vegetable matter and animal waste. This was used to produce Nitre, a constituent of gunpowder.
related: Saltpetre Works
in scheme: First World War Project
broader: Gunpowder Manufacturing Site
license: http://creativecommons.org/licenses/by/3.0
publisher: www.historicengland.org.uk

Barracks
type: Concept
license: http://creativecommons.org/licenses/by/3.0
scope note: A building used to house members of the armed forces.
attribution URL: http://www.historicengland.org.uk
in scheme: First World War Project
publisher: www.historicengland.org.uk
broader: Ancillary Building
attribution name: Historic England
issued: 2019-07-18T10:15:51

Proving House
type: Concept
in scheme: First World War Project
alternative label: Testing Works
license: http://creativecommons.org/licenses/by/3.0
scope note: A building used for the testing of weapons for quality, accuracy and explosive power.
alternative label: Proof House
attribution URL: http://www.historicengland.org.uk
broader: Armament Manufacturing Site
attribution name: Historic England
issued: 2019-07-18T10:15:51
publisher: www.historicengland.org.uk

Regimental Headquarters
type: Concept
broader: Ancillary Building
attribution URL: http://www.historicengland.org.uk
scope note: The main administrative building and headquarters of a regiment.
issued: 2019-07-18T10:15:51
attribution name: Historic England
license: http://creativecommons.org/licenses/by/3.0
narrower: Drill Hall
in scheme: First World War Project
publisher: www.historicengland.org.uk

Drill Hall
type: Concept
issued: 2019-07-18T10:15:51
broader: Regimental Headquarters
in scheme: First World War Project
attribution URL: http://www.historicengland.org.uk
scope note: A building or site used for the exercise and training of military personnel.
publisher: www.historicengland.org.uk
license: http://creativecommons.org/licenses/by/3.0
attribution name: Historic England

Tank Factory
type: Concept
attribution URL: http://www.historicengland.org.uk
in scheme: First World War Project
issued: 2019-07-18T10:15:51
license: http://creativecommons.org/licenses/by/3.0
attribution name: Historic England
publisher: www.historicengland.org.uk
scope note: A factory for the manufacture of military tanks.
broader: Vehicle Factory

Charge House
type: Concept
issued: 2019-07-18T10:15:51
attribution name: Historic England
broader: Explosives Manufacturing Site
publisher: www.historicengland.org.uk
attribution URL: http://www.historicengland.org.uk
alternative label: Ripe Charge House
in scheme: First World War Project
scope note: Workshop, as part of a gunpowder works complex, in which explosive is loaded into shells. Also used for expense magazine, where powder was stored between work processes.
alternative label: Green Charge House
license: http://creativecommons.org/licenses/by/3.0

Naval Battlefield
type: Concept
license: http://creativecommons.org/licenses/by/3.0
attribution URL: http://www.historicengland.org.uk
in scheme: First World War Project
issued: 2019-07-18T10:15:51
attribution name: Historic England
broader: Battlefield
publisher: www.historicengland.org.uk
scope note: Area or zone of sea where a battle, skirmish or action was fought between naval ships or warships and privateers. Not to be used for enemy action upon mercantile ships or a sudden strike by mine/torpedo against an enemy warship.

Royal Navy Shore Establishment
type: Concept
in scheme: First World War Project
attribution URL: http://www.historicengland.org.uk
license: http://creativecommons.org/licenses/by/3.0
broader: Military Defence And Fortification
scope note: A complex of buildings used as a headquarters and training base for Royal Navy personnel. Even though they are buildings on land shore establishments are deemed to be shipsand are designated 'HMS' eg. HMS Dolphin in Portsmouth.
issued: 2019-07-18T10:15:51
attribution name: Historic England
publisher: www.historicengland.org.uk

Seaplane Shed (Type G)
type: Concept
in scheme: First World War Project
scope note: A side-opening steel framed shed. A smaller version of the SEAPLANE SHED (TYPE F) they were built from 1916 on RNAS seaplane bases.
attribution URL: http://www.historicengland.org.uk
broader: Seaplane Shed
publisher: www.historicengland.org.uk
attribution name: Historic England
issued: 2019-07-18T10:15:51
license: http://creativecommons.org/licenses/by/3.0

Supply Depot
type: Concept
in scheme: First World War Project
publisher: www.historicengland.org.uk
attribution URL: http://www.historicengland.org.uk
license: http://creativecommons.org/licenses/by/3.0
issued: 2019-07-18T10:15:51
attribution name: Historic England
scope note: A building or site used for the storage and distribution of the essential logistical requirements of an armed force.
broader: Depot

Sign
type: Concept
in scheme: First World War Project
broader: Unassigned
attribution URL: http://www.historicengland.org.uk
scope note: A board, wall painting or other structure displaying advice, giving information or directions.
license: http://creativecommons.org/licenses/by/3.0
issued: 2019-07-18T10:15:51
attribution name: Historic England
publisher: www.historicengland.org.uk

Gun Emplacement (Type 55483)
type: Concept
issued: 2019-07-18T10:15:51
license: http://creativecommons.org/licenses/by/3.0
attribution name: Historic England
in scheme: First World War Project
broader: Gun Emplacement
publisher: www.historicengland.org.uk
attribution URL: http://www.historicengland.org.uk
scope note: A gun emplacment which conforms to Department of Fortification and Works drawing number 55483.

Quartermasters Store
type: Concept
scope note: A building or group of buildings used for the storage and issuing of rations and equipment to an army unit.
issued: 2019-07-18T10:15:51
attribution name: Historic England
broader: Ancillary Building
attribution URL: http://www.historicengland.org.uk
publisher: www.historicengland.org.uk
in scheme: First World War Project
license: http://creativecommons.org/licenses/by/3.0

Light Bomber
type: Concept
publisher: www.historicengland.org.uk
broader: Bomber
attribution name: Historic England
in scheme: First World War Project
scope note: High speed, short to medium-range bomber, usually powered by two engines.
license: http://creativecommons.org/licenses/by/3.0
attribution URL: http://www.historicengland.org.uk
issued: 2019-07-18T10:15:51

Aeroplane Repair Section Shed
type: Concept
broader: Technical And Instructional Site
attribution name: Historic England
license: http://creativecommons.org/licenses/by/3.0
issued: 2019-07-18T10:15:51
publisher: www.historicengland.org.uk
scope note: A shed used for the maintenance and repair of aircraft.
in scheme: First World War Project
attribution URL: http://www.historicengland.org.uk

Ambulance Station
type: Concept
attribution name: Historic England
issued: 2019-07-18T10:15:51
broader: Ancillary Building
publisher: www.historicengland.org.uk
attribution URL: http://www.historicengland.org.uk
license: http://creativecommons.org/licenses/by/3.0
scope note: A building where ambulances and paramedic personnel are housed awaiting emergency calls.
in scheme: First World War Project

Food Depot
type: Concept
publisher: www.historicengland.org.uk
issued: 2019-07-18T10:15:51
in scheme: First World War Project
scope note: A building or site used for the storage and distribution of food.
attribution URL: http://www.historicengland.org.uk
license: http://creativecommons.org/licenses/by/3.0
attribution name: Historic England
broader: Depot

Coastal Fort
type: Concept
attribution URL: http://www.historicengland.org.uk
license: http://creativecommons.org/licenses/by/3.0
broader: Coastal Defence Site
in scheme: First World War Project
attribution name: Historic England
issued: 2019-07-18T10:15:51
scope note: A fortification constructed either on the coast, or in the middle of a stretch of water, designed to protect a port or river from enemy incursion.
publisher: www.historicengland.org.uk

Workshop
type: Concept
license: http://creativecommons.org/licenses/by/3.0
attribution URL: http://www.historicengland.org.uk
in scheme: First World War Project
scope note: A building or room used for small scale manufacture or maintenance.
publisher: www.historicengland.org.uk
broader: Ancillary Building
issued: 2019-07-18T10:15:51
attribution name: Historic England

Seaplane Station
type: Concept
broader: Military Site
issued: 2019-07-18T10:15:51
license: http://creativecommons.org/licenses/by/3.0
attribution name: Historic England
in scheme: First World War Project
publisher: www.historicengland.org.uk
attribution URL: http://www.historicengland.org.uk
scope note: A building complex with hangars and slipways built adjacent to a body of water where seaplanes can be stored and maintained.

Airmens Quarters
type: Concept
issued: 2019-07-18T10:15:51
scope note: A building where non-commissioned aircrew are housed.
in scheme: First World War Project
attribution URL: http://www.historicengland.org.uk
publisher: www.historicengland.org.uk
broader: Ancillary Building
license: http://creativecommons.org/licenses/by/3.0
attribution name: Historic England

Gun Emplacement (Type 55414)
type: Concept
in scheme: First World War Project
issued: 2019-07-18T10:15:51
broader: Gun Emplacement
attribution URL: http://www.historicengland.org.uk
license: http://creativecommons.org/licenses/by/3.0
attribution name: Historic England
publisher: www.historicengland.org.uk
scope note: A gun emplacement which conforms to Department of Fortification and Works drawing number 55414.

Water Tank
type: Concept
attribution name: Historic England
in scheme: First World War Project
broader: Water Storage Facility
publisher: www.historicengland.org.uk
attribution URL: http://www.historicengland.org.uk
issued: 2019-07-18T10:15:51
license: http://creativecommons.org/licenses/by/3.0
scope note: A receptacle for the storage of water.

Water Storage Facility
type: Concept
issued: 2019-07-18T10:15:51
attribution name: Historic England
publisher: www.historicengland.org.uk
attribution URL: http://www.historicengland.org.uk
license: http://creativecommons.org/licenses/by/3.0
broader: Storage Facility
narrower: Water Tower
in scheme: First World War Project
scope note: A site or building containing tanks and pipes and used to store large quantities of water.
narrower: Water Tank

Glider Tug
type: Concept
issued: 2019-07-18T10:15:51
attribution name: Historic England
scope note: An aircraft used for towing gliders aloft.
attribution URL: http://www.historicengland.org.uk
publisher: www.historicengland.org.uk
in scheme: First World War Project
license: http://creativecommons.org/licenses/by/3.0
broader: Tug

Tug
type: Concept
license: http://creativecommons.org/licenses/by/3.0
attribution URL: http://www.historicengland.org.uk
in scheme: First World War Project
publisher: www.historicengland.org.uk
broader: Aircraft <By Function>
narrower: Glider Tug
scope note: An aircraft used for towing another aircraft or object, such as a glider or target.
issued: 2019-07-18T10:15:51
attribution name: Historic England

Submarine Mine Establishment
type: Concept
issued: 2019-07-18T10:15:51
attribution name: Historic England
publisher: www.historicengland.org.uk
scope note: A complex of purpose-built or adapted buildings used for the maintenance, storage, assembly and control of sea mines and minefields.
license: http://creativecommons.org/licenses/by/3.0
broader: Coastal Defence Site
attribution URL: http://www.historicengland.org.uk
in scheme: First World War Project

Match Lodge
type: Concept
broader: Explosives Manufacturing Site
scope note: A building at the entrance to an factory manufacturing explosives where a person was searched for matches, prior to entering the workplace.
in scheme: First World War Project
attribution URL: http://www.historicengland.org.uk
license: http://creativecommons.org/licenses/by/3.0
issued: 2019-07-18T10:15:51
attribution name: Historic England
publisher: www.historicengland.org.uk

Royal Naval Depot
type: Concept
scope note: A building or site used for the storage and distribution of the essential logistical requirements of the Royal Navy.
issued: 2019-07-18T10:15:51
attribution name: Historic England
attribution URL: http://www.historicengland.org.uk
publisher: www.historicengland.org.uk
in scheme: First World War Project
license: http://creativecommons.org/licenses/by/3.0
broader: Depot

Triumphal Arch
type: Concept
publisher: www.historicengland.org.uk
in scheme: First World War Project
attribution name: Historic England
attribution URL: http://www.historicengland.org.uk
license: http://creativecommons.org/licenses/by/3.0
scope note: A large free-standing arch erected to commemorate a triumph or victory.
broader: Commemorative Monument
issued: 2019-07-18T10:15:51

Sound Mirror (30 Feet)
type: Concept
publisher: www.historicengland.org.uk
in scheme: First World War Project
attribution URL: http://www.historicengland.org.uk
scope note: A concrete, circular concave dish 30 feet in diameter used as an acoustic listening device to detect approaching enemy aircraft.
broader: Sound Mirror
license: http://creativecommons.org/licenses/by/3.0
issued: 2019-07-18T10:15:51
attribution name: Historic England

Airship Station
type: Concept
license: http://creativecommons.org/licenses/by/3.0
attribution URL: http://www.historicengland.org.uk
in scheme: First World War Project
issued: 2019-07-18T10:15:51
attribution name: Historic England
broader: Military Defence And Fortification
publisher: www.historicengland.org.uk
scope note: A site, including hangars, moorings and ancillary buildings, used for the storage, maintenance, take off and landing of airships.

Picric Acid Works
type: Concept
attribution URL: http://www.historicengland.org.uk
broader: Explosives Factory
in scheme: First World War Project
issued: 2019-07-18T10:15:51
license: http://creativecommons.org/licenses/by/3.0
attribution name: Historic England
publisher: www.historicengland.org.uk
scope note: A chemical works engaged in the manufacture of the coal tar derivative, picric acid, often associated with the textile industry where it was used as a dye, but more commonly with the explosives industry where it was used as the shell filling Lyddite.

Glider
type: Concept
license: http://creativecommons.org/licenses/by/3.0
broader: Aircraft <By Form>
attribution URL: http://www.historicengland.org.uk
in scheme: First World War Project
publisher: www.historicengland.org.uk
issued: 2019-07-18T10:15:51
scope note: An engineless aeroplane, designed to be towed aloft, that travels suspended by upward air currents.
attribution name: Historic England

Prisoner Of War Camp
type: Concept
attribution URL: http://www.historicengland.org.uk
broader: Military Defence And Fortification
issued: 2019-07-18T10:15:51
scope note: A prison site for the containment of servicemen captured in war.
in scheme: First World War Project
attribution name: Historic England
license: http://creativecommons.org/licenses/by/3.0
publisher: www.historicengland.org.uk

Machine Gun Post
type: Concept
issued: 2019-07-18T10:15:51
broader: Machine Gun Emplacement
publisher: www.historicengland.org.uk
attribution URL: http://www.historicengland.org.uk
scope note: An open walled structure built of concrete, brick or sandbags which enclosed one or more machine-guns mounted on pintels for light anti-aircraft and ground defence.
attribution name: Historic England
license: http://creativecommons.org/licenses/by/3.0
in scheme: First World War Project

Airco DH6
type: Concept
broader: Airco
issued: 2019-07-18T10:15:51
attribution name: Historic England
publisher: www.historicengland.org.uk
alternative label: Dh6
broader: Biplane
scope note: Originally designed as a trainer but relegated to use by the RNAS in a Maritime Reconnaissance and anti-submarine role when the Avro 504 became the standard trainer.
license: http://creativecommons.org/licenses/by/3.0
attribution URL: http://www.historicengland.org.uk
broader: Reconnaissance
in scheme: First World War Project

War Production Factory
type: Concept
issued: 2019-07-18T10:15:51
attribution name: Historic England
broader: Factory
publisher: www.historicengland.org.uk
in scheme: First World War Project
license: http://creativecommons.org/licenses/by/3.0
scope note: A factory or works which has been temporarily turned over to the manufacture of goods for the war effort.
attribution URL: http://www.historicengland.org.uk

Gun Testing Shop
type: Concept
license: http://creativecommons.org/licenses/by/3.0
in scheme: First World War Project
alternative label: Gun Barrel Proof House
publisher: www.historicengland.org.uk
scope note: A workshop for testing guns, incorporating louvred sheds to serve as firing ranges.
broader: Armament Manufacturing Site
attribution URL: http://www.historicengland.org.uk
issued: 2019-07-18T10:15:51
attribution name: Historic England

Cordite Dough Store
type: Concept
attribution URL: http://www.historicengland.org.uk
license: http://creativecommons.org/licenses/by/3.0
scope note: A building in which cordite dough is stored before extrusion.
in scheme: First World War Project
attribution name: Historic England
issued: 2019-07-18T10:15:51
broader: Explosives Manufacturing Site
publisher: www.historicengland.org.uk

Ammunition Depot
type: Concept
broader: Depot
alternative label: Ammunition Dump
attribution URL: http://www.historicengland.org.uk
attribution name: Historic England
issued: 2019-07-18T10:15:51
license: http://creativecommons.org/licenses/by/3.0
in scheme: First World War Project
scope note: A building or site used for the storage and distribution of ammunition.
publisher: www.historicengland.org.uk

Requisitioned Building
type: Concept
broader: Ancillary Building
attribution URL: http://www.historicengland.org.uk
issued: 2019-07-18T10:15:51
related: Requisitioned Land
license: http://creativecommons.org/licenses/by/3.0
in scheme: First World War Project
publisher: www.historicengland.org.uk
attribution name: Historic England
scope note: A building which has been temporarily taken over for use by the military or civilian authorities. During wartime buildings were requisitioned for various purposes, such as temporary hospitals or headquarters.

Water Tower
type: Concept
license: http://creativecommons.org/licenses/by/3.0
attribution name: Historic England
scope note: A tower serving as a reservoir to deliver water at a required point.
in scheme: First World War Project
publisher: www.historicengland.org.uk
broader: Water Storage Facility
issued: 2019-07-18T10:15:51
attribution URL: http://www.historicengland.org.uk

Hydraulic Accumulator Tower
type: Concept
broader: Hydraulic Power Site
in scheme: First World War Project
attribution URL: http://www.historicengland.org.uk
scope note: A structure used for the production of hydraulic power. A head of water was raised at the top of the tower by means of pumps. Used for powering machinery.
issued: 2019-07-18T10:15:51
license: http://creativecommons.org/licenses/by/3.0
attribution name: Historic England
publisher: www.historicengland.org.uk

Hydraulic Power Site
type: Concept
publisher: www.historicengland.org.uk
attribution name: Historic England
issued: 2019-07-18T10:15:51
in scheme: First World War Project
broader: Power Generation Site
license: http://creativecommons.org/licenses/by/3.0
narrower: Hydraulic Accumulator Tower
attribution URL: http://www.historicengland.org.uk

Emergency Food Centre
type: Concept
license: http://creativecommons.org/licenses/by/3.0
attribution name: Historic England
in scheme: First World War Project
broader: Military Defence And Fortification
publisher: www.historicengland.org.uk
scope note: An establishment from which food is distributed to the public during wartime or similar states of emergency.
issued: 2019-07-18T10:15:51
attribution URL: http://www.historicengland.org.uk

Cotton Waste Works
type: Concept
publisher: www.historicengland.org.uk
broader: Factory
attribution name: Historic England
issued: 2019-07-18T10:15:51
in scheme: First World War Project
license: http://creativecommons.org/licenses/by/3.0
scope note: A works where cotton waste is stored or processed.
alternative label: Cotton Waste Mill
attribution URL: http://www.historicengland.org.uk

MkVIII
type: Concept
scope note: Mark 8 or the eighth variant of an aircraft with its associated modifications.
issued: 2019-07-18T10:15:51
attribution name: Historic England
broader: Aircraft Mark
publisher: www.historicengland.org.uk
attribution URL: http://www.historicengland.org.uk
license: http://creativecommons.org/licenses/by/3.0
in scheme: First World War Project

Mineral Jelly Store
type: Concept
issued: 2019-07-18T10:15:51
license: http://creativecommons.org/licenses/by/3.0
attribution name: Historic England
scope note: A building where mineral jelly was stored. Mineral jelly was used as a stabilizer in the manufacture of the explosive, cordite.
broader: Explosives Manufacturing Site
in scheme: First World War Project
attribution URL: http://www.historicengland.org.uk
publisher: www.historicengland.org.uk

Blast Wall
type: Concept
attribution URL: http://www.historicengland.org.uk
in scheme: First World War Project
issued: 2019-07-18T10:15:51
license: http://creativecommons.org/licenses/by/3.0
attribution name: Historic England
publisher: www.historicengland.org.uk
scope note: A reinforced wall designed to reflect the blast from an explosion. Often found associated with powder magazines, pillboxes and air raid shelters.
broader: Ancillary Building

Rostral Column
type: Concept
issued: 2019-07-18T10:15:51
scope note: A column set on a pedestal and decorated with the bows of warships to celebrate naval victories. Originally a Roman form, it was revived in 17th and 18th century decoration.
license: http://creativecommons.org/licenses/by/3.0
attribution name: Historic England
in scheme: First World War Project
publisher: www.historicengland.org.uk
broader: Commemorative Monument
attribution URL: http://www.historicengland.org.uk

MkIIB
type: Concept
attribution name: Historic England
license: http://creativecommons.org/licenses/by/3.0
scope note: A Mark 2A aircraft which has undergone slight modifications to enhance performance or armament.
issued: 2019-07-18T10:15:51
publisher: www.historicengland.org.uk
attribution URL: http://www.historicengland.org.uk
broader: Aircraft Mark
in scheme: First World War Project

Triplane
type: Concept
publisher: www.historicengland.org.uk
attribution name: Historic England
issued: 2019-07-18T10:15:51
in scheme: First World War Project
scope note: An aeroplane featuring three wings, or planes, placed one above the other either side of its fuselage.
license: http://creativecommons.org/licenses/by/3.0
broader: Aircraft <By Form>
attribution URL: http://www.historicengland.org.uk

Squadron Office
type: Concept
in scheme: First World War Project
attribution URL: http://www.historicengland.org.uk
license: http://creativecommons.org/licenses/by/3.0
broader: Military Office
attribution name: Historic England
issued: 2019-07-18T10:15:51
publisher: www.historicengland.org.uk
scope note: A building used for the administration of a squadron.

Military Office
type: Concept
in scheme: First World War Project
narrower: Squadron Office
issued: 2019-07-18T10:15:51
attribution URL: http://www.historicengland.org.uk
license: http://creativecommons.org/licenses/by/3.0
attribution name: Historic England
publisher: www.historicengland.org.uk
broader: Ancillary Building
scope note: An administrative building used to organize and co-ordinate the activities of members of the armed forces.

Generator House
type: Concept
publisher: www.historicengland.org.uk
issued: 2019-07-18T10:15:51
in scheme: First World War Project
attribution URL: http://www.historicengland.org.uk
scope note: A building housing a generator used to power electrical equipment.
broader: Ancillary Building
license: http://creativecommons.org/licenses/by/3.0
attribution name: Historic England

Boom Defence
type: Concept
license: http://creativecommons.org/licenses/by/3.0
attribution URL: http://www.historicengland.org.uk
in scheme: First World War Project
publisher: www.historicengland.org.uk
broader: Coastal Defence Site
scope note: A bar, chain or other obstruction stretched across a waterway to obstruct navigation.
issued: 2019-07-18T10:15:51
attribution name: Historic England

Embarkation Point
type: Concept
in scheme: First World War Project
attribution URL: http://www.historicengland.org.uk
license: http://creativecommons.org/licenses/by/3.0
scope note: Muster/departure points from which troops embarked for their journey to the Front.
broader: Military Defence And Fortification
attribution name: Historic England
issued: 2019-07-18T10:15:51
publisher: www.historicengland.org.uk

Defence Work
type: Concept
broader: Defence Site
issued: 2019-07-18T10:15:51
license: http://creativecommons.org/licenses/by/3.0
attribution name: Historic England
scope note: Sites, buildings or structures believed to be associated with defence but unidentifiable as specific monument types.
attribution URL: http://www.historicengland.org.uk
publisher: www.historicengland.org.uk
in scheme: First World War Project

MkV
type: Concept
attribution URL: http://www.historicengland.org.uk
in scheme: First World War Project
scope note: Mark 5 or the fifth variant of an aircraft with its associated modifications.
issued: 2019-07-18T10:15:51
broader: Aircraft Mark
attribution name: Historic England
publisher: www.historicengland.org.uk
license: http://creativecommons.org/licenses/by/3.0

Minewatchers Post
type: Concept
attribution URL: http://www.historicengland.org.uk
in scheme: First World War Project
scope note: A building with small observation ports used for plotting mines dropped by parachute.
attribution name: Historic England
issued: 2019-07-18T10:15:51
license: http://creativecommons.org/licenses/by/3.0
broader: Coastal Observation Post
publisher: www.historicengland.org.uk

Trophy
type: Concept
license: http://creativecommons.org/licenses/by/3.0
attribution URL: http://www.historicengland.org.uk
publisher: www.historicengland.org.uk
scope note: A monument erected as a permanent reminder of a military victory. The design usually includes images of the spoils of the battle.
issued: 2019-07-18T10:15:51
in scheme: First World War Project
attribution name: Historic England
broader: Commemorative Monument

MkIIIA
type: Concept
attribution name: Historic England
scope note: A Mark 3 aircraft which has undergone slight modifications to enhance performance or armament.
license: http://creativecommons.org/licenses/by/3.0
publisher: www.historicengland.org.uk
attribution URL: http://www.historicengland.org.uk
broader: Aircraft Mark
in scheme: First World War Project
issued: 2019-07-18T10:15:51

Minefield
type: Concept
issued: 2019-07-18T10:15:51
license: http://creativecommons.org/licenses/by/3.0
attribution name: Historic England
in scheme: First World War Project
scope note: An area of ground or water containing explosive mines.
publisher: www.historicengland.org.uk
attribution URL: http://www.historicengland.org.uk
related: Extended Defence Officers Post
broader: Coastal Defence Site

Extended Defence Officers Post
type: Concept
in scheme: First World War Project
related: Minefield
broader: Coastal Defence Site
attribution URL: http://www.historicengland.org.uk
scope note: An observation post for a naval officer in charge of a marine minefield.
publisher: www.historicengland.org.uk
attribution name: Historic England
issued: 2019-07-18T10:15:51
license: http://creativecommons.org/licenses/by/3.0

Airco DH9
type: Concept
alternative label: Dh9
in scheme: First World War Project
license: http://creativecommons.org/licenses/by/3.0
attribution name: Historic England
issued: 2019-07-18T10:15:51
broader: Airco
publisher: www.historicengland.org.uk
broader: Bomber
attribution URL: http://www.historicengland.org.uk
scope note: Developed from the DH4, featured the pilot and gunner cockpits in closer proximity, but suffered from engine reliability problems. Also known as the Ninak, saw service from 1918 to 1931.

Guardhouse
type: Concept
broader: Ancillary Building
attribution name: Historic England
license: http://creativecommons.org/licenses/by/3.0
alternative label: Guard Room
issued: 2019-07-18T10:15:51
publisher: www.historicengland.org.uk
scope note: A building used for the accommodation of a military guard and/or the detainment of prisoners.
in scheme: First World War Project
attribution URL: http://www.historicengland.org.uk

Anti Motor Torpedo Boat Battery
type: Concept
in scheme: First World War Project
broader: Coast Artillery Battery
attribution URL: http://www.historicengland.org.uk
scope note: A coastal battery containing one or more artillery pieces for to defend the coast against hostile motor torpedo boats.
publisher: www.historicengland.org.uk
attribution name: Historic England
issued: 2019-07-18T10:15:51
license: http://creativecommons.org/licenses/by/3.0

Air Force Headquarters
type: Concept
attribution URL: http://www.historicengland.org.uk
attribution name: Historic England
issued: 2019-07-18T10:15:51
license: http://creativecommons.org/licenses/by/3.0
in scheme: First World War Project
broader: Military Headquarters
publisher: www.historicengland.org.uk
scope note: A building used for the daily administration of the Royal Flying Corps or Royal Air Force.

Infantry Post
type: Concept
issued: 2019-07-18T10:15:51
publisher: www.historicengland.org.uk
attribution URL: http://www.historicengland.org.uk
scope note: A defensive position, often constructed from sandbags, designed to protect a group of infantry.
alternative label: Rifle Post
attribution name: Historic England
license: http://creativecommons.org/licenses/by/3.0
broader: Fieldwork
in scheme: First World War Project

Gun Store
type: Concept
broader: Heavy Anti Aircraft Battery
license: http://creativecommons.org/licenses/by/3.0
attribution URL: http://www.historicengland.org.uk
in scheme: First World War Project
issued: 2019-07-18T10:15:51
publisher: www.historicengland.org.uk
scope note: A building used for the storage of artillery pieces.
attribution name: Historic England

Aeroplane Twin Shed
type: Concept
broader: Aircraft Hangar
in scheme: First World War Project
issued: 2019-07-18T10:15:51
scope note: A coupled timber built end-opening First World War aircraft hangar.
attribution URL: http://www.historicengland.org.uk
license: http://creativecommons.org/licenses/by/3.0
attribution name: Historic England
publisher: www.historicengland.org.uk

Nightfighter
type: Concept
issued: 2019-07-18T10:15:51
attribution name: Historic England
publisher: www.historicengland.org.uk
broader: Fighter
scope note: A light, high speed aircraft equipped specifically to engage in night combat.
attribution URL: http://www.historicengland.org.uk
license: http://creativecommons.org/licenses/by/3.0
in scheme: First World War Project

Fabrication Shed
type: Concept
attribution name: Historic England
broader: Marine Engineering Works
license: http://creativecommons.org/licenses/by/3.0
issued: 2019-07-18T10:15:51
publisher: www.historicengland.org.uk
scope note: Covered area for making large engineered constructions such as sections of ships or bridges.
attribution URL: http://www.historicengland.org.uk
in scheme: First World War Project

Nitrocellulose Powder Factory
type: Concept
scope note: A factory or works principally engaged in the production of a single base propellant, using nitrocellulose without the addition of nitroglycerine.
attribution name: Historic England
broader: Explosives Factory
in scheme: First World War Project
publisher: www.historicengland.org.uk
attribution URL: http://www.historicengland.org.uk
issued: 2019-07-18T10:15:51
license: http://creativecommons.org/licenses/by/3.0

Dynamite Factory
type: Concept
broader: Explosives Factory
issued: 2019-07-18T10:15:51
in scheme: First World War Project
license: http://creativecommons.org/licenses/by/3.0
publisher: www.historicengland.org.uk
scope note: A works or factory principally engaged in the manufacture of dynamite.
attribution URL: http://www.historicengland.org.uk
attribution name: Historic England

Airfield
type: Concept
broader: Airfield Site
attribution URL: http://www.historicengland.org.uk
scope note: An area or site used for the landing and take-off of aircraft, often including associated buildings, equipment and other installations.
issued: 2019-07-18T10:15:51
alternative label: Aircraft Landing Ground
attribution name: Historic England
license: http://creativecommons.org/licenses/by/3.0
in scheme: First World War Project
publisher: www.historicengland.org.uk

Medium Bomber
type: Concept
scope note: A bomber designed to operate with medium bombloads over medium distances.The medium bomber was generally considered to be any design that delivered about 4,000 lb (1.8 t) over ranges of about 1,500 to 2,000 miles (2,400 to 3,200 km).
attribution name: Historic England
attribution URL: http://www.historicengland.org.uk
publisher: www.historicengland.org.uk
broader: Bomber
in scheme: First World War Project
issued: 2019-07-18T10:15:51
license: http://creativecommons.org/licenses/by/3.0

Admiralty Signal Station
type: Concept
attribution URL: http://www.historicengland.org.uk
license: http://creativecommons.org/licenses/by/3.0
scope note: A building or site used for naval communications.
in scheme: First World War Project
broader: Military Defence And Fortification
issued: 2019-07-18T10:15:51
attribution name: Historic England
publisher: www.historicengland.org.uk

Close Defence Battery
type: Concept
attribution name: Historic England
issued: 2019-07-18T10:15:51
in scheme: First World War Project
publisher: www.historicengland.org.uk
attribution URL: http://www.historicengland.org.uk
scope note: A coastal battery designed for use in short range engagements with enemy vessels, minelayers, blockships and torpedo craft.
license: http://creativecommons.org/licenses/by/3.0
broader: Coast Artillery Battery

Military Building
type: Concept
attribution name: Historic England
broader: Military Defence And Fortification
license: http://creativecommons.org/licenses/by/3.0
issued: 2019-07-18T10:15:51
publisher: www.historicengland.org.uk
scope note: A building of unknown purpose found at a military site. Use more specific type where known.
attribution URL: http://www.historicengland.org.uk
in scheme: First World War Project

Recreation Hut
type: Concept
publisher: www.historicengland.org.uk
license: http://creativecommons.org/licenses/by/3.0
scope note: A hut, usually built as part of a complex on a military base or airfield and used for the recreation of military personnel.
issued: 2019-07-18T10:15:51
attribution name: Historic England
broader: Ancillary Building
in scheme: First World War Project
attribution URL: http://www.historicengland.org.uk

Firing Range Blockhouse
type: Concept
attribution URL: http://www.historicengland.org.uk
alternative label: Firing Range Shelter
attribution name: Historic England
issued: 2019-07-18T10:15:51
license: http://creativecommons.org/licenses/by/3.0
in scheme: First World War Project
broader: Firing Range
publisher: www.historicengland.org.uk
scope note: A shelter on a firing range from which the weapons testing can be viewed in safety.

Incorporating Mill
type: Concept
issued: 2019-07-18T10:15:51
broader: Gunpowder Manufacturing Site
attribution name: Historic England
scope note: A stone edge-runner grinding machine or mill used for mechanically grinding and mixing the ingredients of gunpowder.
in scheme: First World War Project
attribution URL: http://www.historicengland.org.uk
license: http://creativecommons.org/licenses/by/3.0
publisher: www.historicengland.org.uk

Target Range
type: Concept
issued: 2019-07-18T10:15:51
narrower: Target Railway
license: http://creativecommons.org/licenses/by/3.0
attribution name: Historic England
scope note: An area of ground used for the testing of, and practicing with, weapons against fixed and moveable targets.
in scheme: First World War Project
publisher: www.historicengland.org.uk
attribution URL: http://www.historicengland.org.uk
broader: Firing Range

Target Railway
type: Concept
publisher: www.historicengland.org.uk
in scheme: First World War Project
scope note: A miniature railway on which targets can be placed to provide moving targets on a firing range.
attribution URL: http://www.historicengland.org.uk
broader: Target Range
license: http://creativecommons.org/licenses/by/3.0
attribution name: Historic England
issued: 2019-07-18T10:15:51

Torpedo Bomber
type: Concept
license: http://creativecommons.org/licenses/by/3.0
attribution URL: http://www.historicengland.org.uk
in scheme: First World War Project
broader: Bomber
issued: 2019-07-18T10:15:51
attribution name: Historic England
scope note: Aircraft designed for the carrying and dropping of torpedoes.
publisher: www.historicengland.org.uk

MkXIV
type: Concept
issued: 2019-07-18T10:15:51
attribution name: Historic England
broader: Aircraft Mark
in scheme: First World War Project
publisher: www.historicengland.org.uk
attribution URL: http://www.historicengland.org.uk
license: http://creativecommons.org/licenses/by/3.0
scope note: Mark 14 or the fourteenth variant of an aircraft with its associated modifications.

Saltpetre Store
type: Concept
publisher: www.historicengland.org.uk
broader: Gunpowder Manufacturing Site
license: http://creativecommons.org/licenses/by/3.0
attribution URL: http://www.historicengland.org.uk
attribution name: Historic England
scope note: A place where saltpetre, the chief component of gunpowder, is kept.
in scheme: First World War Project
issued: 2019-07-18T10:15:51

Coach Works
type: Concept
attribution URL: http://www.historicengland.org.uk
scope note: Traditionally a building or site where stage coaches were built. Nowadays the term is applied to buildings used for the manufacturing of the body work and furnishings of motor vehicles and railway carriages.
issued: 2019-07-18T10:15:51
broader: Engineering Works
in scheme: First World War Project
attribution name: Historic England
license: http://creativecommons.org/licenses/by/3.0
broader: Motor Vehicle Engineering Site
publisher: www.historicengland.org.uk

Airship Construction Works
type: Concept
in scheme: First World War Project
issued: 2019-07-18T10:15:51
attribution URL: http://www.historicengland.org.uk
license: http://creativecommons.org/licenses/by/3.0
attribution name: Historic England
publisher: www.historicengland.org.uk
broader: Aircraft Engineering Site
scope note: Construction works for the production of rigid or dirigible airships.

Defence Line
type: Concept
attribution URL: http://www.historicengland.org.uk
issued: 2019-07-18T10:15:51
broader: Defence Site
in scheme: First World War Project
attribution name: Historic England
license: http://creativecommons.org/licenses/by/3.0
scope note: A system of defensive works such as anti-tank obstacles, ditches and pillboxes, designed to stop the advance of an enemy. Defence lines were constructed across and around strategic areas of ground and sites such as industrial towns.
publisher: www.historicengland.org.uk

Balloon Shed
type: Concept
in scheme: First World War Project
broader: Aircraft Engineering Site
attribution name: Historic England
issued: 2019-07-18T10:15:51
related: Airship Hangar
publisher: www.historicengland.org.uk
attribution URL: http://www.historicengland.org.uk
license: http://creativecommons.org/licenses/by/3.0
scope note: A building used for fabricating balloon and airship envelopes.

Target
type: Concept
publisher: www.historicengland.org.uk
in scheme: First World War Project
broader: Aircraft <By Function>
scope note: An aircraft, usually towed or radio-controlled, designed for use as an air-to-air, or ground-toair, gunnery target.
license: http://creativecommons.org/licenses/by/3.0
narrower: Target Tug
issued: 2019-07-18T10:15:51
attribution name: Historic England
attribution URL: http://www.historicengland.org.uk

Target Tug
type: Concept
license: http://creativecommons.org/licenses/by/3.0
attribution name: Historic England
issued: 2019-07-18T10:15:51
in scheme: First World War Project
scope note: An aircraft used for the towing of targets.
publisher: www.historicengland.org.uk
broader: Target
attribution URL: http://www.historicengland.org.uk

Engineering Industry Site
type: Concept
narrower: Vehicle Engineering Site
attribution name: Historic England
license: http://creativecommons.org/licenses/by/3.0
narrower: Engineering Works
scope note: Buildings, sites and structures associated with the engineering industry.
narrower: Boring Mill
issued: 2019-07-18T10:15:51
broader: Industrial
publisher: www.historicengland.org.uk
in scheme: First World War Project
attribution URL: http://www.historicengland.org.uk

Boring Mill
type: Concept
publisher: www.historicengland.org.uk
in scheme: First World War Project
attribution URL: http://www.historicengland.org.uk
license: http://creativecommons.org/licenses/by/3.0
issued: 2019-07-18T10:15:51
broader: Engineering Industry Site
attribution name: Historic England
narrower: Cannon Boring Mill
scope note: A building containing a machine tool for boring out large cylindrical holes in items such as steam engine cylinders, pump barrels, etc.

Shipwrights Workshop
type: Concept
issued: 2019-07-18T10:15:51
attribution name: Historic England
broader: Marine Workshop
attribution URL: http://www.historicengland.org.uk
publisher: www.historicengland.org.uk
scope note: A place where dockyard craftsmen both design and build ships.
in scheme: First World War Project
license: http://creativecommons.org/licenses/by/3.0

MkVII
type: Concept
attribution URL: http://www.historicengland.org.uk
broader: Aircraft Mark
issued: 2019-07-18T10:15:51
in scheme: First World War Project
attribution name: Historic England
license: http://creativecommons.org/licenses/by/3.0
scope note: Mark 7 or the seventh variant of an aircraft with its associated modifications.
publisher: www.historicengland.org.uk

Named Tree
type: Concept
broader: Commemorative Monument
attribution URL: http://www.historicengland.org.uk
attribution name: Historic England
scope note: A tree named after a person or event associated with it, e.g. Byron's Oak at Newstead.
issued: 2019-07-18T10:15:51
license: http://creativecommons.org/licenses/by/3.0
in scheme: First World War Project
publisher: www.historicengland.org.uk
related: Historical Site

Wet Guncotton Magazine
type: Concept
license: http://creativecommons.org/licenses/by/3.0
attribution URL: http://www.historicengland.org.uk
broader: Explosives Manufacturing Site
in scheme: First World War Project
issued: 2019-07-18T10:15:51
attribution name: Historic England
publisher: www.historicengland.org.uk
scope note: A building in which moist guncotton is stored prior to drying for cordite maunufacture.

Ammonal Works
type: Concept
issued: 2019-07-18T10:15:51
broader: Explosives Factory
attribution name: Historic England
in scheme: First World War Project
scope note: A works engaged principally in the manufacture of ammonal explosives.
attribution URL: http://www.historicengland.org.uk
license: http://creativecommons.org/licenses/by/3.0
publisher: www.historicengland.org.uk

Minelayer
type: Concept
publisher: www.historicengland.org.uk
in scheme: First World War Project
attribution URL: http://www.historicengland.org.uk
broader: Aircraft <By Function>
license: http://creativecommons.org/licenses/by/3.0
scope note: An aircraft equipped to deploy explosive mines.
attribution name: Historic England
issued: 2019-07-18T10:15:51

Gelignite Works
type: Concept
attribution name: Historic England
broader: Explosives Factory
in scheme: First World War Project
scope note: A factory or works principally engaged in the manufacture of the explosive Gelignite.
publisher: www.historicengland.org.uk
attribution URL: http://www.historicengland.org.uk
issued: 2019-07-18T10:15:51
license: http://creativecommons.org/licenses/by/3.0

MkXI
type: Concept
publisher: www.historicengland.org.uk
attribution URL: http://www.historicengland.org.uk
attribution name: Historic England
issued: 2019-07-18T10:15:51
license: http://creativecommons.org/licenses/by/3.0
in scheme: First World War Project
scope note: Mark 11 or the eleventh variant of an aircraft with its associated modifications.
broader: Aircraft Mark

Womens Royal Air Force Camp
type: Concept
in scheme: First World War Project
broader: Military Camp
attribution URL: http://www.historicengland.org.uk
scope note: A camp used for the accommodation of members of the Womens Royal Air Force who undertook a variety of essential roles within the RAF to enable their male counterparts to fight more effectively.
attribution name: Historic England
publisher: www.historicengland.org.uk
issued: 2019-07-18T10:15:51
license: http://creativecommons.org/licenses/by/3.0

Territorial Army Headquarters
type: Concept
in scheme: First World War Project
attribution URL: http://www.historicengland.org.uk
license: http://creativecommons.org/licenses/by/3.0
issued: 2019-07-18T10:15:51
scope note: A building used as headquarters by the Territorial Army, the volunteer reserve of the British army.
broader: Military Headquarters
attribution name: Historic England
publisher: www.historicengland.org.uk

Airfield Defence Site
type: Concept
issued: 2019-07-18T10:15:51
attribution name: Historic England
publisher: www.historicengland.org.uk
broader: Defence Site
license: http://creativecommons.org/licenses/by/3.0
attribution URL: http://www.historicengland.org.uk
scope note: A site or building associated with active or passive defence of the landing ground and buildings of an airfield.
in scheme: First World War Project

Listening Post
type: Concept
related: Sound Mirror
attribution name: Historic England
license: http://creativecommons.org/licenses/by/3.0
issued: 2019-07-18T10:15:51
broader: Passive Air Defence Site
publisher: www.historicengland.org.uk
in scheme: First World War Project
attribution URL: http://www.historicengland.org.uk

Communications Building
type: Concept
license: http://creativecommons.org/licenses/by/3.0
broader: Ancillary Building
attribution URL: http://www.historicengland.org.uk
narrower: Radio Station
publisher: www.historicengland.org.uk
scope note: A building associated with the transmission and gathering of information.
attribution name: Historic England
issued: 2019-07-18T10:15:51
in scheme: First World War Project
narrower: Signals Gathering Station

Signals Gathering Station
type: Concept
license: http://creativecommons.org/licenses/by/3.0
in scheme: First World War Project
broader: Communications Building
publisher: www.historicengland.org.uk
issued: 2019-07-18T10:15:51
scope note: Buildings and structures associated with the acquisition of electronic signals for the purpose of intelligence gathering.
attribution URL: http://www.historicengland.org.uk
attribution name: Historic England

Shot Tower
type: Concept
attribution URL: http://www.historicengland.org.uk
attribution name: Historic England
issued: 2019-07-18T10:15:51
license: http://creativecommons.org/licenses/by/3.0
in scheme: First World War Project
broader: Armament Manufacturing Site
scope note: A tower in which shot is made from molten lead poured through sieves at top and falling into water at the bottom.
publisher: www.historicengland.org.uk

Airco DH1
type: Concept
broader: Biplane
attribution name: Historic England
license: http://creativecommons.org/licenses/by/3.0
broader: Fighter
issued: 2019-07-18T10:15:51
publisher: www.historicengland.org.uk
alternative label: Dh1
attribution URL: http://www.historicengland.org.uk
in scheme: First World War Project
broader: Airco
scope note: A single-seat, pusher prop, escort and patrolfighter. Used in the UK in a Home Defence role until superseded in 1917.

Slip Shed
type: Concept
attribution name: Historic England
license: http://creativecommons.org/licenses/by/3.0
broader: Marine Workshop
issued: 2019-07-18T10:15:51
related: Dockyard
scope note: A wooden or metal structure covering a shipbuilding slip way.
publisher: www.historicengland.org.uk
attribution URL: http://www.historicengland.org.uk
in scheme: First World War Project

Corning House
type: Concept
issued: 2019-07-18T10:15:51
license: http://creativecommons.org/licenses/by/3.0
broader: Gunpowder Manufacturing Site
attribution name: Historic England
in scheme: First World War Project
scope note: A processing house containing equipment for sieving caked gunpowder to produce graded granules.
publisher: www.historicengland.org.uk
attribution URL: http://www.historicengland.org.uk

Art Storage Facility
type: Concept
license: http://creativecommons.org/licenses/by/3.0
scope note: A site used for the safe storage of the art held in the national collections. During the Second World War many paintings, sculptures and works of art were moved to modified mines for safe keeping to protect them against bomb damage.
attribution URL: http://www.historicengland.org.uk
issued: 2019-07-18T10:15:51
attribution name: Historic England
broader: Storage Facility
in scheme: First World War Project
publisher: www.historicengland.org.uk

Barrage Balloon Site
type: Concept
broader: Anti Aircraft Defence Site
issued: 2019-07-18T10:15:51
attribution name: Historic England
publisher: www.historicengland.org.uk
license: http://creativecommons.org/licenses/by/3.0
scope note: A site where a single large balloon was attached by fine wire cables to the ground to form an aerial obstruction to attacking enemy aircraft.
attribution URL: http://www.historicengland.org.uk
in scheme: First World War Project

Coat Of Arms
type: Concept
attribution name: Historic England
broader: Commemorative Monument
license: http://creativecommons.org/licenses/by/3.0
alternative label: Crest
in scheme: First World War Project
publisher: www.historicengland.org.uk
attribution URL: http://www.historicengland.org.uk
issued: 2019-07-18T10:15:51
scope note: Includes crests, hatchments and supporters.

Gelatine Works (Explosive)
type: Concept
in scheme: First World War Project
attribution URL: http://www.historicengland.org.uk
publisher: www.historicengland.org.uk
broader: Explosives Factory
license: http://creativecommons.org/licenses/by/3.0
attribution name: Historic England
issued: 2019-07-18T10:15:51
scope note: A factory or works principally engaged in the manufacture of blasing or explosive gelatine.

Gun Emplacement (Type 55415)
type: Concept
broader: Gun Emplacement
publisher: www.historicengland.org.uk
license: http://creativecommons.org/licenses/by/3.0
scope note: A gun emplacement which conforms to Department of Fortification and Works drawing number 55415.
attribution URL: http://www.historicengland.org.uk
attribution name: Historic England
in scheme: First World War Project
issued: 2019-07-18T10:15:51

Chemical Weapons Store
type: Concept
attribution URL: http://www.historicengland.org.uk
in scheme: First World War Project
issued: 2019-07-18T10:15:51
license: http://creativecommons.org/licenses/by/3.0
attribution name: Historic England
publisher: www.historicengland.org.uk
scope note: A protected building or site used for the safe storage of chemical weapons.
broader: Storage Facility

Seaplane Shed (Type F)
type: Concept
attribution URL: http://www.historicengland.org.uk
scope note: A military side-opening aircraft hangar originally designed for seaplanes and used RNAS bases from 1916. Steel framed with asbestos or corrugated iron cladding.
issued: 2019-07-18T10:15:51
broader: Seaplane Shed
in scheme: First World War Project
attribution name: Historic England
license: http://creativecommons.org/licenses/by/3.0
publisher: www.historicengland.org.uk

Anti Aircraft Gun Emplacement
type: Concept
license: http://creativecommons.org/licenses/by/3.0
attribution name: Historic England
scope note: A gun emplacement equipped with anti aircraft artillery.
broader: Anti Aircraft Battery
in scheme: First World War Project
issued: 2019-07-18T10:15:51
broader: Gun Emplacement
publisher: www.historicengland.org.uk
attribution URL: http://www.historicengland.org.uk

Nissen Hut
type: Concept
issued: 2019-07-18T10:15:51
publisher: www.historicengland.org.uk
in scheme: First World War Project
broader: Ancillary Building
scope note: A prefabricated structure of a steel frame clad in corrugated iron. Semi-circular in section they were used as accommodation for the armed forces and, during WWII, as emergency housing for bombed out civilians. Also used for storage.
attribution name: Historic England
license: http://creativecommons.org/licenses/by/3.0
attribution URL: http://www.historicengland.org.uk

Bicycle Factory
type: Concept
broader: Vehicle Factory
scope note: A factory for the assembly of bicycles.
attribution URL: http://www.historicengland.org.uk
attribution name: Historic England
issued: 2019-07-18T10:15:51
license: http://creativecommons.org/licenses/by/3.0
in scheme: First World War Project
publisher: www.historicengland.org.uk
broader: Vehicle Engineering Site

Chimney
type: Concept
issued: 2019-07-18T10:15:51
attribution name: Historic England
publisher: www.historicengland.org.uk
broader: Industrial Building
license: http://creativecommons.org/licenses/by/3.0
scope note: Chimney used on an industrial or commercial site.
attribution URL: http://www.historicengland.org.uk
alternative label: Chimney Stack
in scheme: First World War Project

Airco DH4
type: Concept
in scheme: First World War Project
broader: Biplane
alternative label: Dh4
broader: Bomber
broader: Airco
attribution URL: http://www.historicengland.org.uk
publisher: www.historicengland.org.uk
scope note: A two-seat, single-engine bomber. Fast, versatile and well armed, but with a fuel tank poorly placed between pilot and gunner, was considered to be the best day bomber of the First World War. Later entered civil service.
attribution name: Historic England
issued: 2019-07-18T10:15:51
license: http://creativecommons.org/licenses/by/3.0

Phenol Works
type: Concept
license: http://creativecommons.org/licenses/by/3.0
broader: Explosives Factory
attribution URL: http://www.historicengland.org.uk
publisher: www.historicengland.org.uk
attribution name: Historic England
issued: 2019-07-18T10:15:51
in scheme: First World War Project
scope note: A chemical works engaged in the production of the coal tar derivative phenol, a chemical used for the manufacture of explosives during WWI.

Gun Emplacement (Type 55503)
type: Concept
publisher: www.historicengland.org.uk
license: http://creativecommons.org/licenses/by/3.0
attribution URL: http://www.historicengland.org.uk
issued: 2019-07-18T10:15:51
attribution name: Historic England
scope note: A gun emplacment which conforms to Department of Fortification and Works drawing number 55503.
in scheme: First World War Project
broader: Gun Emplacement

Vehicle Depot
type: Concept
broader: Depot
attribution URL: http://www.historicengland.org.uk
scope note: A storage facility used for the accommodation and dispersal of military vehicles.
attribution name: Historic England
issued: 2019-07-18T10:15:51
license: http://creativecommons.org/licenses/by/3.0
in scheme: First World War Project
publisher: www.historicengland.org.uk

Animal Memorial
type: Concept
attribution URL: http://www.historicengland.org.uk
issued: 2019-07-18T10:15:51
license: http://creativecommons.org/licenses/by/3.0
attribution name: Historic England
in scheme: First World War Project
alternative label: Horse Memorial
broader: Commemorative Monument
alternative label: Dog Memorial
publisher: www.historicengland.org.uk

Instructional Site
type: Concept
attribution URL: http://www.historicengland.org.uk
in scheme: First World War Project
issued: 2019-07-18T10:15:51
license: http://creativecommons.org/licenses/by/3.0
attribution name: Historic England
publisher: www.historicengland.org.uk
broader: Technical And Instructional Site
scope note: A site used to train military personnel in the use of equipment.

Storage Building
type: Concept
issued: 2019-07-18T10:15:51
attribution name: Historic England
attribution URL: http://www.historicengland.org.uk
license: http://creativecommons.org/licenses/by/3.0
publisher: www.historicengland.org.uk
in scheme: First World War Project
broader: Storage Facility
scope note: A building used for the storage of equipment and ordnance.

Bomb Crater
type: Concept
attribution URL: http://www.historicengland.org.uk
broader: Military Defence And Fortification
issued: 2019-07-18T10:15:51
in scheme: First World War Project
attribution name: Historic England
license: http://creativecommons.org/licenses/by/3.0
scope note: A depression in the ground caused by the explosion of a mine or bombshell.
publisher: www.historicengland.org.uk

Pillbox (Shellproof)
type: Concept
broader: Pillbox
publisher: www.historicengland.org.uk
attribution URL: http://www.historicengland.org.uk
scope note: A pillbox with walls that have been thickened to protect against shells.
license: http://creativecommons.org/licenses/by/3.0
issued: 2019-07-18T10:15:51
attribution name: Historic England
in scheme: First World War Project

Cannon Foundry
type: Concept
attribution URL: http://www.historicengland.org.uk
publisher: www.historicengland.org.uk
scope note: A workshop or factory where the barrels of cannon are cast.
in scheme: First World War Project
license: http://creativecommons.org/licenses/by/3.0
attribution name: Historic England
broader: Armament Manufacturing Site
issued: 2019-07-18T10:15:51

MkXVI
type: Concept
attribution name: Historic England
broader: Aircraft Mark
issued: 2019-07-18T10:15:51
in scheme: First World War Project
publisher: www.historicengland.org.uk
attribution URL: http://www.historicengland.org.uk
license: http://creativecommons.org/licenses/by/3.0
scope note: Mark 16 or the sixteenth variant of an aircraft with its associated modifications.

First Aid Post
type: Concept
attribution name: Historic England
license: http://creativecommons.org/licenses/by/3.0
attribution URL: http://www.historicengland.org.uk
scope note: A building with first aid facilities to deal with accidents and other medical emergencies.
related: Civil Defence Site
in scheme: First World War Project
broader: Military Defence And Fortification
issued: 2019-07-18T10:15:51
related: Hospital
publisher: www.historicengland.org.uk

Armoury
type: Concept
attribution name: Historic England
license: http://creativecommons.org/licenses/by/3.0
in scheme: First World War Project
publisher: www.historicengland.org.uk
broader: Ancillary Building
attribution URL: http://www.historicengland.org.uk
issued: 2019-07-18T10:15:51
scope note: A secure building where weaponry and ammunition are kept.

Naval Headquarters
type: Concept
attribution URL: http://www.historicengland.org.uk
in scheme: First World War Project
scope note: A building used for the daily administration of the Royal Navy.
issued: 2019-07-18T10:15:51
license: http://creativecommons.org/licenses/by/3.0
attribution name: Historic England
publisher: www.historicengland.org.uk
broader: Military Headquarters

Fire Tender House
type: Concept
attribution URL: http://www.historicengland.org.uk
in scheme: First World War Project
issued: 2019-07-18T10:15:51
license: http://creativecommons.org/licenses/by/3.0
attribution name: Historic England
publisher: www.historicengland.org.uk
broader: Technical And Instructional Site
scope note: A building, on an airfield, used to house a fire engine.

Ministry Of Munitions Factory
type: Concept
issued: 2019-07-18T10:15:51
attribution name: Historic England
in scheme: First World War Project
scope note: A factory used for the manufacture of ordnance including small arms, ammunition, artillery pieces and armoured fighting vehicles.
attribution URL: http://www.historicengland.org.uk
license: http://creativecommons.org/licenses/by/3.0
broader: Military Defence And Fortification
publisher: www.historicengland.org.uk

Naval Dockyard
type: Concept
in scheme: First World War Project
attribution name: Historic England
issued: 2019-07-18T10:15:51
publisher: www.historicengland.org.uk
attribution URL: http://www.historicengland.org.uk
license: http://creativecommons.org/licenses/by/3.0
broader: Dockyard
scope note: A naval base that builds, repairs, docks or converts warships, and is manned by civilian engineers and workers and administered by engineer duty officers.

Fire Station
type: Concept
scope note: A building housing fire engines, and equipment and a permanent fire-fighting force.
broader: Ancillary Building
issued: 2019-07-18T10:15:51
publisher: www.historicengland.org.uk
attribution URL: http://www.historicengland.org.uk
attribution name: Historic England
license: http://creativecommons.org/licenses/by/3.0
in scheme: First World War Project

Official Residence
type: Concept
in scheme: First World War Project
issued: 2019-07-18T10:15:51
attribution URL: http://www.historicengland.org.uk
license: http://creativecommons.org/licenses/by/3.0
attribution name: Historic England
publisher: www.historicengland.org.uk
broader: Ancillary Building
scope note: Used where an existing building is designated as the residence of an official.

Operations Block
type: Concept
attribution URL: http://www.historicengland.org.uk
attribution name: Historic England
issued: 2019-07-18T10:15:51
license: http://creativecommons.org/licenses/by/3.0
in scheme: First World War Project
scope note: A building of varying designs intended for directing military aviation operations. Normally associated with military airfields.
publisher: www.historicengland.org.uk
broader: Technical And Instructional Site

Nieuport
type: Concept
license: http://creativecommons.org/licenses/by/3.0
attribution name: Historic England
issued: 2019-07-18T10:15:51
in scheme: First World War Project
publisher: www.historicengland.org.uk
broader: Aircraft <By Manufacturer>
scope note: A French aeroplane company that primarily built racing aircraft before World War I and fighter aircraft during World War I and between the wars. First set up in 1902 as manufacturer of engine components, then aircraft in 1911 as Nieuport et Deplante.
attribution URL: http://www.historicengland.org.uk

Monoplane
type: Concept
broader: Aircraft <By Form>
license: http://creativecommons.org/licenses/by/3.0
attribution name: Historic England
issued: 2019-07-18T10:15:51
scope note: An aircraft with a single wing, or plane, either side of its fuselage.
in scheme: First World War Project
narrower: Fokker
publisher: www.historicengland.org.uk
attribution URL: http://www.historicengland.org.uk

Sound Mirror Building
type: Concept
scope note: A building associated with the early 20th century acoustic detection system.
license: http://creativecommons.org/licenses/by/3.0
attribution URL: http://www.historicengland.org.uk
in scheme: First World War Project
issued: 2019-07-18T10:15:51
attribution name: Historic England
publisher: www.historicengland.org.uk
broader: Passive Air Defence Site